Home | About | Sematext search-lucene.com search-hadoop.com
 Search Hadoop and all its subprojects:

Switch to Threaded View
HBase, mail # dev - Re: Build failed in Jenkins: HBase-0.92 #396


Copy link to this message
-
Re: Build failed in Jenkins: HBase-TRUNK #2930
Jesse Yates 2012-05-26, 23:42
Working on a patch.
-------------------
Jesse Yates
@jesse_yates
jyates.github.com
On Sat, May 26, 2012 at 4:34 PM, Ted Yu <[EMAIL PROTECTED]> wrote:

> I saw the following in
> target/surefire-reports/org.apache.hadoop.hbase.TestInfoServers-output.txt:
>
> 2012-05-26 16:22:38,181 FATAL [Master:0;198.134.91.122,58958,1338074554839]
> master.HMaster(1605): Master server abort: loaded coprocessors are: []
>
> 2012-05-26 16:22:38,181 FATAL [Master:0;198.134.91.122,58958,1338074554839]
> master.HMaster(1610): Unhandled exception. Starting shutdown.
> java.io.FileNotFoundException: hbase-webapps/master not found in CLASSPATH
>  at
> org.apache.hadoop.hbase.util.InfoServer.getWebAppsPath(InfoServer.java:110)
>  at
> org.apache.hadoop.hbase.util.InfoServer.getWebAppsPath(InfoServer.java:127)
>  at org.apache.hadoop.http.HttpServer.<init>(HttpServer.java:159)
>  at org.apache.hadoop.http.HttpServer.<init>(HttpServer.java:113)
>  at org.apache.hadoop.hbase.util.InfoServer.<init>(InfoServer.java:62)
>  at
>
> org.apache.hadoop.hbase.master.HMaster.startServiceThreads(HMaster.java:925)
>  at
>
> org.apache.hadoop.hbase.master.HMaster.finishInitialization(HMaster.java:585)
>  at org.apache.hadoop.hbase.master.HMaster.run(HMaster.java:386)
>  at java.lang.Thread.run(Thread.java:680)
>
> On Sat, May 26, 2012 at 4:30 PM, Apache Jenkins Server <
> [EMAIL PROTECTED]> wrote:
>
> > See <https://builds.apache.org/job/HBase-TRUNK/2930/>
> >
> > ------------------------------------------
> > [...truncated 6048 lines...]
> > Running org.apache.hadoop.hbase.replication.TestReplication
> > Tests run: 10, Failures: 0, Errors: 0, Skipped: 0, Time elapsed: 151.071
> > sec
> >
> > Results :
> >
> > Tests in error:
> >  org.apache.hadoop.hbase.master.TestZKBasedOpenCloseRegion: Shutting down
> >  org.apache.hadoop.hbase.TestInfoServers: Shutting down
> >
> > Tests run: 993, Failures: 0, Errors: 2, Skipped: 9
> >
> > [INFO]
> > ------------------------------------------------------------------------
> > [INFO] Reactor Summary:
> > [INFO]
> > [INFO] HBase ............................................. SUCCESS
> [1.898s]
> > [INFO] HBase - Server .................................... FAILURE
> > [38:00.596s]
> > [INFO] HBase - Assembly .................................. SKIPPED
> > [INFO] HBase - Site ...................................... SKIPPED
> > [INFO]
> > ------------------------------------------------------------------------
> > [INFO] BUILD FAILURE
> > [INFO]
> > ------------------------------------------------------------------------
> > [INFO] Total time: 38:05.792s
> > [INFO] Finished at: Sat May 26 23:30:17 UTC 2012
> > [INFO] Final Memory: 42M/458M
> > [INFO]
> > ------------------------------------------------------------------------
> > [ERROR] Failed to execute goal
> > org.apache.maven.plugins:maven-surefire-plugin:2.12-TRUNK-HBASE-2:test
> > (secondPartTestsExecution) on project hbase-server: There are test
> failures.
> > [ERROR]
> > [ERROR] Please refer to <
> >
> https://builds.apache.org/job/HBase-TRUNK/ws/trunk/hbase-server/target/surefire-reports
> >
> > for the individual test results.
> > [ERROR] -> [Help 1]
> > org.apache.maven.lifecycle.LifecycleExecutionException: Failed to execute
> > goal
> org.apache.maven.plugins:maven-surefire-plugin:2.12-TRUNK-HBASE-2:test
> > (secondPartTestsExecution) on project hbase-server: There are test
> failures.
> >
> > Please refer to <
> >
> https://builds.apache.org/job/HBase-TRUNK/ws/trunk/hbase-server/target/surefire-reports
> >
> > for the individual test results.
> >        at
> >
> org.apache.maven.lifecycle.internal.MojoExecutor.execute(MojoExecutor.java:213)
> >        at
> >
> org.apache.maven.lifecycle.internal.MojoExecutor.execute(MojoExecutor.java:153)
> >        at
> >
> org.apache.maven.lifecycle.internal.MojoExecutor.execute(MojoExecutor.java:145)
> >        at
> >
> org.apache.maven.lifecycle.internal.LifecycleModuleBuilder.buildProject(LifecycleModuleBuilder.java:84)
> >        at