Home | About | Sematext search-lucene.com search-hadoop.com
NEW: Monitor These Apps!
elasticsearch, apache solr, apache hbase, hadoop, redis, casssandra, amazon cloudwatch, mysql, memcached, apache kafka, apache zookeeper, apache storm, ubuntu, centOS, red hat, debian, puppet labs, java, senseiDB
 Search Hadoop and all its subprojects:

Switch to Threaded View
Hive >> mail # dev >> Building Hive


Copy link to this message
-
Re: Building Hive
https://cwiki.apache.org/confluence/display/Hive/HiveDeveloperFAQ#HiveDeveloperFAQ-Howtobuildallsource
?
On Mon, Jan 6, 2014 at 12:42 PM, Konstantin Weitz <
[EMAIL PROTECTED]> wrote:

> Thanks, that got me a bit further. I ran
>
> mvn compile -Phadoop-2
>
> Unfortunately, now I get the following error. Any clue why?
>
> [INFO]
> ------------------------------------------------------------------------
> [INFO] Building Hive Service 0.13.0-SNAPSHOT
> [INFO]
> ------------------------------------------------------------------------
> [INFO]
> ------------------------------------------------------------------------
> [INFO] Reactor Summary:
> [INFO]
> [INFO] Hive .............................................. SUCCESS [0.938s]
> [INFO] Hive Ant Utilities ................................ SUCCESS [1.288s]
> [INFO] Hive Shims Common ................................. SUCCESS [0.513s]
> [INFO] Hive Shims 0.20 ................................... SUCCESS [0.410s]
> [INFO] Hive Shims Secure Common .......................... SUCCESS [0.322s]
> [INFO] Hive Shims 0.20S .................................. SUCCESS [0.178s]
> [INFO] Hive Shims 0.23 ................................... SUCCESS [0.612s]
> [INFO] Hive Shims ........................................ SUCCESS [0.097s]
> [INFO] Hive Common ....................................... SUCCESS [5.665s]
> [INFO] Hive Serde ........................................ SUCCESS [9.090s]
> [INFO] Hive Metastore .................................... SUCCESS
> [17.912s]
> [INFO] Hive Query Language ............................... SUCCESS
> [34.242s]
> [INFO] Hive Service ...................................... FAILURE [1.049s]
> [INFO] Hive JDBC ......................................... SKIPPED
> [INFO] Hive Beeline ...................................... SKIPPED
> [INFO] Hive CLI .......................................... SKIPPED
> [INFO] Hive Contrib ...................................... SKIPPED
> [INFO] Hive HBase Handler ................................ SKIPPED
> [INFO] Hive HCatalog ..................................... SKIPPED
> [INFO] Hive HCatalog Core ................................ SKIPPED
> [INFO] Hive HCatalog Pig Adapter ......................... SKIPPED
> [INFO] Hive HCatalog Server Extensions ................... SKIPPED
> [INFO] Hive HCatalog Webhcat Java Client ................. SKIPPED
> [INFO] Hive HCatalog Webhcat ............................. SKIPPED
> [INFO] Hive HCatalog HBase Storage Handler ............... SKIPPED
> [INFO] Hive HWI .......................................... SKIPPED
> [INFO] Hive ODBC ......................................... SKIPPED
> [INFO] Hive Shims Aggregator ............................. SKIPPED
> [INFO] Hive TestUtils .................................... SKIPPED
> [INFO] Hive Packaging .................................... SKIPPED
> [INFO]
> ------------------------------------------------------------------------
> [INFO] BUILD FAILURE
> [INFO]
> ------------------------------------------------------------------------
> [INFO] Total time: 1:13.287s
> [INFO] Finished at: Mon Jan 06 12:41:09 PST 2014
> [INFO] Final Memory: 44M/458M
> [INFO]
> ------------------------------------------------------------------------
> [ERROR] Failed to execute goal on project hive-service: Could not resolve
> dependencies for project org.apache.hive:hive-service:jar:0.13.0-SNAPSHOT:
> Could not find artifact org.apache.hive:hive-exec:jar:tests:0.13.0-SNAPSHOT
> -> [Help 1]
> [ERROR]
> [ERROR] To see the full stack trace of the errors, re-run Maven with the -e
> switch.
> [ERROR] Re-run Maven using the -X switch to enable full debug logging.
> [ERROR]
> [ERROR] For more information about the errors and possible solutions,
> please read the following articles:
> [ERROR] [Help 1]
>
> http://cwiki.apache.org/confluence/display/MAVEN/DependencyResolutionException
> [ERROR]
> [ERROR] After correcting the problems, you can resume the build with the
> command
> [ERROR]   mvn <goals> -rf :hive-service

CONFIDENTIALITY NOTICE
NOTICE: This message is intended for the use of the individual or entity to
which it is addressed and may contain information that is confidential,
privileged and exempt from disclosure under applicable law. If the reader
of this message is not the intended recipient, you are hereby notified that
any printing, copying, dissemination, distribution, disclosure or
forwarding of this communication is strictly prohibited. If you have
received this communication in error, please contact the sender immediately
and delete it from your system. Thank You.
NEW: Monitor These Apps!
elasticsearch, apache solr, apache hbase, hadoop, redis, casssandra, amazon cloudwatch, mysql, memcached, apache kafka, apache zookeeper, apache storm, ubuntu, centOS, red hat, debian, puppet labs, java, senseiDB