Home | About | Sematext search-lucene.com search-hadoop.com
 Search Hadoop and all its subprojects:

Switch to Threaded View
Pig, mail # user - pig-0.9.1 "ant test": 67 test cases failed with sun-jdk(1.6.0_27-ea) and Ant 1.8.2


Copy link to this message
-
Re:Re: pig-0.9.1 "ant test": 67 test cases failed with sun-jdk(1.6.0_27-ea) and Ant 1.8.2
lulynn_2008 2011-11-19, 15:12
Thank you.
My environment is same with you. Maybe this is caused by pig package. I got from http://m.devlib.org/apache/pig/pig-0.9.1/pig-0.9.1.tar.gz.
Could you please tell me where you get pig-0.9.1?
Please provide exact web link.
Thank you.

At 2011-11-19 01:08:25,"Alan Gates" <[EMAIL PROTECTED]> wrote:
>
>On Nov 16, 2011, at 6:57 PM, lulynn_2008 wrote:
>
>> Hello all,
>> I run "ant test" to pig-0.9.1, and the following test cases failed. My questions are:
>> --Is there any jira for these failed test case?
>A quick search of Pig's JIRA didn't turn any up.
>> --I assume all test cases should be passed for pig-0.9.1 released. Is this correct?
>
>Yes.
>
>> --If you can pass all test case, what is your environment(especially jdk version and ant version)?
>
>Linux version 2.6, java version 1.6.0_05, HotSpot Server VM, Ant 1.8.2
>
>Alan.
>
>
>> Thank you.
>>
>>
>>    [junit] Test org.apache.pig.parser.TestErrorHandling FAILED
>>
>>    [junit] Test org.apache.pig.parser.TestLogicalPlanGenerator FAILED
>>
>>    [junit] Test org.apache.pig.parser.TestQueryParser FAILED
>>
>>    [junit] Test org.apache.pig.test.TestAccumulator FAILED
>>
>>    [junit] Test org.apache.pig.test.TestAlgebraicEval FAILED
>>
>>    [junit] Test org.apache.pig.test.TestAlgebraicEvalLocal FAILED
>>
>>    [junit] Test org.apache.pig.test.TestAlgebraicInstantiation FAILED
>>
>>    [junit] Test org.apache.pig.test.TestBZip FAILED
>>
>>    [junit] Test org.apache.pig.test.TestBatchAliases FAILED
>>
>>    [junit] Test org.apache.pig.test.TestCollectedGroup FAILED
>>
>>    [junit] Test org.apache.pig.test.TestCombiner FAILED
>>
>>    [junit] Test org.apache.pig.test.TestCommit FAILED
>>
>>    [junit] Test org.apache.pig.test.TestDataBagAccess FAILED
>>
>>    [junit] Test org.apache.pig.test.TestEvalPipeline FAILED
>>
>>    [junit] Test org.apache.pig.test.TestEvalPipeline2 FAILED (timeout)
>>
>>    [junit] Test org.apache.pig.test.TestEvalPipelineLocal FAILED
>>
>>    [junit] Test org.apache.pig.test.TestExampleGenerator FAILED
>>
>>    [junit] Test org.apache.pig.test.TestFilterOpNumeric FAILED
>>
>>    [junit] Test org.apache.pig.test.TestFilterOpString FAILED
>>
>>    [junit] Test org.apache.pig.test.TestFilterUDF FAILED
>>
>>    [junit] Test org.apache.pig.test.TestFinish FAILED
>>
>>    [junit] Test org.apache.pig.test.TestGrunt FAILED
>>
>>    [junit] Test org.apache.pig.test.TestHBaseStorage FAILED
>>
>>    [junit] Test org.apache.pig.test.TestImplicitSplit FAILED
>>
>>    [junit] Test org.apache.pig.test.TestInfixArithmetic FAILED
>>
>>    [junit] Test org.apache.pig.test.TestInputOutputFileValidator FAILED
>>
>>    [junit] Test org.apache.pig.test.TestJobSubmission FAILED
>>
>>    [junit] Test org.apache.pig.test.TestJoin FAILED
>>
>>    [junit] Test org.apache.pig.test.TestLOLoadDeterminedSchema FAILED
>>
>>    [junit] Test org.apache.pig.test.TestLocal FAILED
>>
>>    [junit] Test org.apache.pig.test.TestLogToPhyCompiler FAILED
>>
>>    [junit] Test org.apache.pig.test.TestLogicalPlanBuilder FAILED
>>
>>    [junit] Test org.apache.pig.test.TestMRCompiler FAILED
>>
>>    [junit] Test org.apache.pig.test.TestMacroExpansion FAILED
>>
>>    [junit] Test org.apache.pig.test.TestMapReduce FAILED
>>
>>    [junit] Test org.apache.pig.test.TestMapSideCogroup FAILED
>>
>>    [junit] Test org.apache.pig.test.TestMergeJoin FAILED
>>
>>    [junit] Test org.apache.pig.test.TestMergeJoinOuter FAILED
>>
>>    [junit] Test org.apache.pig.test.TestMultiQuery FAILED
>>
>>    [junit] Test org.apache.pig.test.TestMultiQueryBasic FAILED
>>
>>    [junit] Test org.apache.pig.test.TestMultiQueryCompiler FAILED
>>
>>    [junit] Test org.apache.pig.test.TestMultiQueryLocal FAILED
>>
>>    [junit] Test org.apache.pig.test.TestNewPlanColumnPrune FAILED
>>
>>    [junit] Test org.apache.pig.test.TestNewPlanImplicitSplit FAILED
>>
>>    [junit] Test org.apache.pig.test.TestPartitionFilterPushDown FAILED
>>
>>    [junit] Test org.apache.pig.test.TestPigContext FAILED