Home | About | Sematext search-lucene.com search-hadoop.com
NEW: Monitor These Apps!
elasticsearch, apache solr, apache hbase, hadoop, redis, casssandra, amazon cloudwatch, mysql, memcached, apache kafka, apache zookeeper, apache storm, ubuntu, centOS, red hat, debian, puppet labs, java, senseiDB
 Search Hadoop and all its subprojects:

Switch to Threaded View
MapReduce >> mail # dev >> Re: Hadoop-Mapreduce-trunk - Build # 1146 - Still Failing


Copy link to this message
-
Re: Hadoop-Mapreduce-trunk - Build # 1161 - Still Failing
This is MAPREDUCE-4470.

On Wed, Aug 8, 2012 at 6:57 AM, Apache Jenkins Server
<[EMAIL PROTECTED]> wrote:
> See https://builds.apache.org/job/Hadoop-Mapreduce-trunk/1161/
>
> ###################################################################################
> ########################## LAST 60 LINES OF THE CONSOLE ###########################
> [...truncated 30212 lines...]
> Tests run: 3, Failures: 0, Errors: 0, Skipped: 0, Time elapsed: 0.166 sec
> Running org.apache.hadoop.mapreduce.lib.partition.TestBinaryPartitioner
> Tests run: 4, Failures: 0, Errors: 0, Skipped: 0, Time elapsed: 0.395 sec
> Running org.apache.hadoop.mapreduce.lib.partition.TestMRKeyFieldBasedPartitioner
> Tests run: 1, Failures: 0, Errors: 0, Skipped: 0, Time elapsed: 0.35 sec
> Running org.apache.hadoop.mapreduce.TestChild
> Tests run: 1, Failures: 0, Errors: 0, Skipped: 0, Time elapsed: 52.402 sec
> Running org.apache.hadoop.mapreduce.filecache.TestURIFragments
> Tests run: 1, Failures: 0, Errors: 0, Skipped: 0, Time elapsed: 0.062 sec
> Running org.apache.hadoop.mapreduce.TestMapReduce
> Tests run: 1, Failures: 0, Errors: 0, Skipped: 0, Time elapsed: 4.51 sec
>
> Results :
>
> Failed tests:   testForEmptyFile(org.apache.hadoop.mapreduce.lib.input.TestCombineFileInputFormat): expected:<0> but was:<1>
>
> Tests run: 384, Failures: 1, Errors: 0, Skipped: 14
>
> [INFO] ------------------------------------------------------------------------
> [INFO] Reactor Summary:
> [INFO]
> [INFO] hadoop-mapreduce-client ........................... SUCCESS [1.896s]
> [INFO] hadoop-mapreduce-client-core ...................... SUCCESS [1:20.805s]
> [INFO] hadoop-mapreduce-client-common .................... SUCCESS [21.085s]
> [INFO] hadoop-mapreduce-client-shuffle ................... SUCCESS [1.072s]
> [INFO] hadoop-mapreduce-client-app ....................... SUCCESS [4:23.178s]
> [INFO] hadoop-mapreduce-client-hs ........................ SUCCESS [1:09.366s]
> [INFO] hadoop-mapreduce-client-jobclient ................. FAILURE [34:36.127s]
> [INFO] Apache Hadoop MapReduce Examples .................. SKIPPED
> [INFO] hadoop-mapreduce .................................. SKIPPED
> [INFO] ------------------------------------------------------------------------
> [INFO] BUILD FAILURE
> [INFO] ------------------------------------------------------------------------
> [INFO] Total time: 41:54.073s
> [INFO] Finished at: Wed Aug 08 13:57:05 UTC 2012
> [INFO] Final Memory: 20M/142M
> [INFO] ------------------------------------------------------------------------
> [ERROR] Failed to execute goal org.apache.maven.plugins:maven-surefire-plugin:2.12:test (default-test) on project hadoop-mapreduce-client-jobclient: There are test failures.
> [ERROR]
> [ERROR] Please refer to /home/jenkins/jenkins-slave/workspace/Hadoop-Mapreduce-trunk/trunk/hadoop-mapreduce-project/hadoop-mapreduce-client/hadoop-mapreduce-client-jobclient/target/surefire-reports for the individual test results.
> [ERROR] -> [Help 1]
> [ERROR]
> [ERROR] To see the full stack trace of the errors, re-run Maven with the -e switch.
> [ERROR] Re-run Maven using the -X switch to enable full debug logging.
> [ERROR]
> [ERROR] For more information about the errors and possible solutions, please read the following articles:
> [ERROR] [Help 1] http://cwiki.apache.org/confluence/display/MAVEN/MojoFailureException
> [ERROR]
> [ERROR] After correcting the problems, you can resume the build with the command
> [ERROR]   mvn <goals> -rf :hadoop-mapreduce-client-jobclient
> Build step 'Execute shell' marked build as failure
> [FINDBUGS] Skipping publisher since build result is FAILURE
> Archiving artifacts
> Updating HDFS-3291
> Updating HDFS-3760
> Updating HDFS-3637
> Updating HDFS-3754
> Email was triggered for: Failure
> Sending email for trigger: Failure
>
>
>
> ###################################################################################
> ############################## FAILED TESTS (if any) ##############################
NEW: Monitor These Apps!
elasticsearch, apache solr, apache hbase, hadoop, redis, casssandra, amazon cloudwatch, mysql, memcached, apache kafka, apache zookeeper, apache storm, ubuntu, centOS, red hat, debian, puppet labs, java, senseiDB