Home | About | Sematext search-lucene.com search-hadoop.com
 Search Hadoop and all its subprojects:

Switch to Threaded View
HBase >> mail # dev >> Re: Build failed in Jenkins: HBase-0.92 #396


Copy link to this message
-
Re: Build failed in Jenkins: HBase-TRUNK #2930
Yeah, but there are bigger issues afoot.

For some reason that change borks the master status page when running the
cluster from a built package.

Also, the submodules will attempt to be tested, so they need to be pom
packaged.

I'm working on getting the master status page to work (or rather, redirect
to /master-status from the port).

-------------------
Jesse Yates
@jesse_yates
jyates.github.com
On Sat, May 26, 2012 at 6:15 PM, Ted Yu <[EMAIL PROTECTED]> wrote:

> The following change allows TestZKBasedOpenCloseRegion and TestInfoServers
> to pass:
>
> Index: hbase-server/pom.xml
> ==================================================================> --- hbase-server/pom.xml    (revision 1342991)
> +++ hbase-server/pom.xml    (working copy)
> @@ -33,6 +33,20 @@
>   <description>Main functionality for HBase</description>
>
>   <build>
> +    <resources>
> +      <resource>
> +        <directory>src/main/resources/</directory>
> +        <includes>
> +          <include>hbase-default.xml</include>
> +        </includes>
> +      </resource>
> +      <resource>
> +        <directory>${project.build.directory}</directory>
> +        <includes>
> +          <include>hbase-webapps/**</include>
> +        </includes>
> +      </resource>
> +    </resources>
>     <plugins>
>       <plugin>
>         <groupId>org.apache.avro</groupId>
>
> On Sat, May 26, 2012 at 4:34 PM, Ted Yu <[EMAIL PROTECTED]> wrote:
>
> > I saw the following in
> >
> target/surefire-reports/org.apache.hadoop.hbase.TestInfoServers-output.txt:
> >
> > 2012-05-26 16:22:38,181 FATAL
> > [Master:0;198.134.91.122,58958,1338074554839] master.HMaster(1605):
> Master
> > server abort: loaded coprocessors are: []
> >
> > 2012-05-26 16:22:38,181 FATAL
> > [Master:0;198.134.91.122,58958,1338074554839] master.HMaster(1610):
> > Unhandled exception. Starting shutdown.
> > java.io.FileNotFoundException: hbase-webapps/master not found in
> CLASSPATH
> >   at
> >
> org.apache.hadoop.hbase.util.InfoServer.getWebAppsPath(InfoServer.java:110)
> >   at
> >
> org.apache.hadoop.hbase.util.InfoServer.getWebAppsPath(InfoServer.java:127)
> >   at org.apache.hadoop.http.HttpServer.<init>(HttpServer.java:159)
> >   at org.apache.hadoop.http.HttpServer.<init>(HttpServer.java:113)
> >   at org.apache.hadoop.hbase.util.InfoServer.<init>(InfoServer.java:62)
> >   at
> >
> org.apache.hadoop.hbase.master.HMaster.startServiceThreads(HMaster.java:925)
> >   at
> >
> org.apache.hadoop.hbase.master.HMaster.finishInitialization(HMaster.java:585)
> >   at org.apache.hadoop.hbase.master.HMaster.run(HMaster.java:386)
> >   at java.lang.Thread.run(Thread.java:680)
> >
> > On Sat, May 26, 2012 at 4:30 PM, Apache Jenkins Server <
> > [EMAIL PROTECTED]> wrote:
> >
> >> See <https://builds.apache.org/job/HBase-TRUNK/2930/>
> >>
> >> ------------------------------------------
> >> [...truncated 6048 lines...]
> >> Running org.apache.hadoop.hbase.replication.TestReplication
> >> Tests run: 10, Failures: 0, Errors: 0, Skipped: 0, Time elapsed: 151.071
> >> sec
> >>
> >> Results :
> >>
> >> Tests in error:
> >>  org.apache.hadoop.hbase.master.TestZKBasedOpenCloseRegion: Shutting
> down
> >>  org.apache.hadoop.hbase.TestInfoServers: Shutting down
> >>
> >> Tests run: 993, Failures: 0, Errors: 2, Skipped: 9
> >>
> >> [INFO]
> >> ------------------------------------------------------------------------
> >> [INFO] Reactor Summary:
> >> [INFO]
> >> [INFO] HBase ............................................. SUCCESS
> >> [1.898s]
> >> [INFO] HBase - Server .................................... FAILURE
> >> [38:00.596s]
> >> [INFO] HBase - Assembly .................................. SKIPPED
> >> [INFO] HBase - Site ...................................... SKIPPED
> >> [INFO]
> >> ------------------------------------------------------------------------
> >> [INFO] BUILD FAILURE
> >> [INFO]
> >> ------------------------------------------------------------------------
> >> [INFO] Total time: 38:05.792s
> >> [INFO] Finished at: Sat May 26 23:30:17 UTC 2012