Home | About | Sematext search-lucene.com search-hadoop.com
 Search Hadoop and all its subprojects:

Switch to Threaded View
Drill, mail # dev - Build error - Help needed


Copy link to this message
-
Re: Build error - Help needed
Jacques Nadeau 2013-08-23, 20:00
Can you give us your entire process from checkout forward as well your
versions of Maven, Java and protoc?

thanks,
Jacques
On Thu, Aug 22, 2013 at 11:23 PM, Arun Sasidharan Nair <
[EMAIL PROTECTED]> wrote:

> Hi All,
>
> I have pulled the latest drill code and was trying to compile the
> prototype.It  failed with following errors.Please tell me how i can fix
> this
>
> [INFO] BUILD FAILURE
> [INFO]
> ------------------------------------------------------------------------
> [INFO] Total time: 11.466s
> [INFO] Finished at: Fri Aug 23 11:50:14 IST 2013
> [INFO] Final Memory: 33M/108M
> [INFO]
> ------------------------------------------------------------------------
> [ERROR] Failed to execute goal
> org.apache.maven.plugins:maven-compiler-plugin:3.0:compile
> (default-compile) on project java-exec: Compilation failure: Compilation
> failure:
> [ERROR]
>
> /home/ubuntu/openworkspace/drill/incubator-drill/sandbox/prototype/exec/java-exec/src/main/java/org/apache/drill/exec/physical/config/MockStorageEngine.java:[29,49]
> cannot find symbol
> [ERROR] symbol:   class ReadEntry
> [ERROR] location: interface org.apache.drill.exec.store.StorageEngine
> [ERROR]
>
> /home/ubuntu/openworkspace/drill/incubator-drill/sandbox/prototype/exec/java-exec/src/main/java/org/apache/drill/exec/physical/config/MockStorageEngine.java:[42,21]
> cannot find symbol
> [ERROR] symbol:   class ReadEntry
> [ERROR] location: class
> org.apache.drill.exec.physical.config.MockStorageEngine
> [ERROR]
>
> /home/ubuntu/openworkspace/drill/incubator-drill/sandbox/prototype/exec/java-exec/src/main/java/org/apache/drill/exec/physical/config/MockStorageEngine.java:[47,80]
> cannot find symbol
> [ERROR] symbol:   class ReadEntry
> [ERROR] location: class
> org.apache.drill.exec.physical.config.MockStorageEngine
> [ERROR]
>
> /home/ubuntu/openworkspace/drill/incubator-drill/sandbox/prototype/exec/java-exec/src/main/java/org/apache/drill/exec/physical/config/MockStorageEngine.java:[47,23]
> cannot find symbol
> [ERROR] symbol:   class ReadEntry
> [ERROR] location: class
> org.apache.drill.exec.physical.config.MockStorageEngine
> [ERROR]
>
> /home/ubuntu/openworkspace/drill/incubator-drill/sandbox/prototype/exec/java-exec/src/main/java/org/apache/drill/exec/physical/config/MockStorageEngine.java:[52,58]
> cannot find symbol
> [ERROR] symbol:   class ReadEntry
> [ERROR] location: class
> org.apache.drill.exec.physical.config.MockStorageEngine
> [ERROR]
>
> /home/ubuntu/openworkspace/drill/incubator-drill/sandbox/prototype/exec/java-exec/src/main/java/org/apache/drill/exec/physical/base/AbstractScan.java:[30,93]
> type org.apache.drill.exec.physical.base.Scan does not take parameters
> [ERROR]
>
> /home/ubuntu/openworkspace/drill/incubator-drill/sandbox/prototype/exec/java-exec/src/main/java/org/apache/drill/exec/physical/config/MockScanPOP.java:[180,14]
> type org.apache.drill.exec.physical.base.Scan does not take parameters
> [ERROR]
>
> /home/ubuntu/openworkspace/drill/incubator-drill/sandbox/prototype/exec/java-exec/src/main/java/org/apache/drill/exec/physical/impl/FilterRecordBatch.java:[74,10]
> cannot find symbol
> [ERROR] symbol:   class TypedFieldId
> [ERROR] location: class
> org.apache.drill.exec.physical.impl.FilterRecordBatch
> [ERROR]
>
> /home/ubuntu/openworkspace/drill/incubator-drill/sandbox/prototype/exec/java-exec/src/main/java/org/apache/drill/exec/store/JSONRecordReader.java:[38,36]
> cannot find symbol
> [ERROR] symbol:   class NullableVarChar4Vector
> [ERROR] location: package org.apache.drill.exec.vector
> [ERROR]
>
> /home/ubuntu/openworkspace/drill/incubator-drill/sandbox/prototype/exec/java-exec/src/main/java/org/apache/drill/exec/physical/impl/VectorHolder.java:[6,48]
> cannot find symbol
> [ERROR] symbol:   class TypedFieldId
> [ERROR] location: interface org.apache.drill.exec.record.RecordBatch
> [ERROR]
>
> /home/ubuntu/openworkspace/drill/incubator-drill/sandbox/prototype/exec/java-exec/src/main/java/org/apache/drill/exec/physical/impl/VectorHolder.java:[19,10]