Home | About | Sematext search-lucene.com search-hadoop.com
 Search Hadoop and all its subprojects:

Switch to Threaded View
Drill, mail # user - mvn clean install failing on RHEL but working on Mac


Copy link to this message
-
mvn clean install failing on RHEL but working on Mac
Kaushik Rangadurai 2013-08-13, 23:35
Here is the error that I'm getting on my RHEL.

[ERROR] Failed to execute goal org.apache.maven.plugins:maven-surefire-plugin:2.15:test (default-test) on project java-exec: There are test failures.
[ERROR]
[ERROR] Please refer to /home/krangadu/Code/Drill/incubator-drill/sandbox/prototype/exec/java-exec/target/surefire-reports for the individual test results.
[ERROR] -> [Help 1]
org.apache.maven.lifecycle.LifecycleExecutionException: Failed to execute goal org.apache.maven.plugins:maven-surefire-plugin:2.15:test (default-test) on project java-exec: There are test failures.

Please refer to /home/krangadu/Code/Drill/incubator-drill/sandbox/prototype/exec/java-exec/target/surefire-reports for the individual test results.
    at org.apache.maven.lifecycle.internal.MojoExecutor.execute(MojoExecutor.java:212)
    at org.apache.maven.lifecycle.internal.MojoExecutor.execute(MojoExecutor.java:153)
    at org.apache.maven.lifecycle.internal.MojoExecutor.execute(MojoExecutor.java:145)
    at org.apache.maven.lifecycle.internal.LifecycleModuleBuilder.buildProject(LifecycleModuleBuilder.java:84)
    at org.apache.maven.lifecycle.internal.LifecycleModuleBuilder.buildProject(LifecycleModuleBuilder.java:59)
    at org.apache.maven.lifecycle.internal.LifecycleStarter.singleThreadedBuild(LifecycleStarter.java:183)
    at org.apache.maven.lifecycle.internal.LifecycleStarter.execute(LifecycleStarter.java:161)
    at org.apache.maven.DefaultMaven.doExecute(DefaultMaven.java:318)
    at org.apache.maven.DefaultMaven.execute(DefaultMaven.java:153)
    at org.apache.maven.cli.MavenCli.execute(MavenCli.java:555)
    at org.apache.maven.cli.MavenCli.doMain(MavenCli.java:214)
    at org.apache.maven.cli.MavenCli.main(MavenCli.java:158)
    at sun.reflect.NativeMethodAccessorImpl.invoke0(Native Method)
    at sun.reflect.NativeMethodAccessorImpl.invoke(NativeMethodAccessorImpl.java:57)
    at sun.reflect.DelegatingMethodAccessorImpl.invoke(DelegatingMethodAccessorImpl.java:43)
    at java.lang.reflect.Method.invoke(Method.java:606)
    at org.codehaus.plexus.classworlds.launcher.Launcher.launchEnhanced(Launcher.java:290)
    at org.codehaus.plexus.classworlds.launcher.Launcher.launch(Launcher.java:230)
    at org.codehaus.plexus.classworlds.launcher.Launcher.mainWithExitCode(Launcher.java:414)
    at org.codehaus.plexus.classworlds.launcher.Launcher.main(Launcher.java:357)
Caused by: org.apache.maven.plugin.MojoFailureException: There are test failures.

Please refer to /home/krangadu/Code/Drill/incubator-drill/sandbox/prototype/exec/java-exec/target/surefire-reports for the individual test results.
    at org.apache.maven.plugin.surefire.SurefireHelper.reportExecution(SurefireHelper.java:82)
    at org.apache.maven.plugin.surefire.SurefirePlugin.handleSummary(SurefirePlugin.java:169)
    at org.apache.maven.plugin.surefire.AbstractSurefireMojo.executeAfterPreconditionsChecked(AbstractSurefireMojo.java:777)
    at org.apache.maven.plugin.surefire.AbstractSurefireMojo.execute(AbstractSurefireMojo.java:645)
    at org.apache.maven.plugin.DefaultBuildPluginManager.executeMojo(DefaultBuildPluginManager.java:106)
    at org.apache.maven.lifecycle.internal.MojoExecutor.execute(MojoExecutor.java:208)
    ... 19 more
[ERROR]
[ERROR]
[ERROR] For more information about the errors and possible solutions, please read the following articles:
[ERROR] [Help 1] http://cwiki.apache.org/confluence/display/MAVEN/MojoFailureException
[ERROR]
[ERROR] After correcting the problems, you can resume the build with the command
[ERROR]   mvn <goals> -rf :java-exec

Kindly let me know if I've missed anything.

Cheers,
Kaushik