Home | About | Sematext search-lucene.com search-hadoop.com
NEW: Monitor These Apps!
elasticsearch, apache solr, apache hbase, hadoop, redis, casssandra, amazon cloudwatch, mysql, memcached, apache kafka, apache zookeeper, apache storm, ubuntu, centOS, red hat, debian, puppet labs, java, senseiDB
 Search Hadoop and all its subprojects:

Switch to Plain View
Hive >> mail # user >> Need rank(), can't build m6d's version


+
Keith Wiley 2013-04-01, 22:45
Copy link to this message
-
Re: Need rank(), can't build m6d's version
approx steps
git clone hive-test
mvn install
git clone hive-rang
mvn install

or just
git clone hive-test
mvn -Dmaven.test.skip=true install

On Mon, Apr 1, 2013 at 6:45 PM, Keith Wiley <[EMAIL PROTECTED]> wrote:

> I need rank() in Hive.  I have't had much luck with Edward Capriolo's on
> git and it comes with no documentation.  It depends on hive-test (also by
> Edward) and I can't get maven to build the tests for hive-test which
> prevents me from building the hive-test package (the jar)...which is all
> pretty tangential to the real goal, which is rank of course.
>
> Is there any place to download the hive-rank jar pre-built instead of
> having to build it out of git?  If not, has anyone built it recently, or
> namely has anyone built the hive-test project it depends on?  The following
> is just one example of the sort of error I see.  Remember this error is on
> hive-test, which frankly I don't even care about.  :-)
>
> Feeling a little desperate...thanks for any help.
>
>
> -------------------------------------------------------------------------------
> Test set: com.jointhegrid.hive_test.EmbeddedHiveExampleTest
>
> -------------------------------------------------------------------------------
> Tests run: 1, Failures: 1, Errors: 0, Skipped: 0, Time elapsed: 8.878 sec
> <<< FAILURE!
> testA(com.jointhegrid.hive_test.EmbeddedHiveExampleTest)  Time elapsed:
> 7.823 sec  <<< FAILURE!
> java.lang.AssertionError: expected:<0> but was:<9>
>         at org.junit.Assert.fail(Assert.java:91)
>         at org.junit.Assert.failNotEquals(Assert.java:645)
>         at org.junit.Assert.assertEquals(Assert.java:126)
>         at org.junit.Assert.assertEquals(Assert.java:470)
>         at org.junit.Assert.assertEquals(Assert.java:454)
>         at
> com.jointhegrid.hive_test.EmbeddedHiveExampleTest.testA(EmbeddedHiveExampleTest.java:51)
>         at sun.reflect.NativeMethodAccessorImpl.invoke0(Native Method)
>         at
> sun.reflect.NativeMethodAccessorImpl.invoke(NativeMethodAccessorImpl.java:39)
>         at
> sun.reflect.DelegatingMethodAccessorImpl.invoke(DelegatingMethodAccessorImpl.java:25)
>         at java.lang.reflect.Method.invoke(Method.java:597)
>         at junit.framework.TestCase.runTest(TestCase.java:168)
>         at junit.framework.TestCase.runBare(TestCase.java:134)
>         at junit.framework.TestResult$1.protect(TestResult.java:110)
>         at junit.framework.TestResult.runProtected(TestResult.java:128)
>         at junit.framework.TestResult.run(TestResult.java:113)
>         at junit.framework.TestCase.run(TestCase.java:124)
>         at junit.framework.TestSuite.runTest(TestSuite.java:243)
>         at junit.framework.TestSuite.run(TestSuite.java:238)
>         at
> org.junit.internal.runners.JUnit38ClassRunner.run(JUnit38ClassRunner.java:83)
>         at
> org.apache.maven.surefire.junit4.JUnit4TestSet.execute(JUnit4TestSet.java:35)
>         at
> org.apache.maven.surefire.junit4.JUnit4Provider.executeTestSet(JUnit4Provider.java:115)
>         at
> org.apache.maven.surefire.junit4.JUnit4Provider.invoke(JUnit4Provider.java:97)
>         at sun.reflect.NativeMethodAccessorImpl.invoke0(Native Method)
>         at
> sun.reflect.NativeMethodAccessorImpl.invoke(NativeMethodAccessorImpl.java:39)
>         at
> sun.reflect.DelegatingMethodAccessorImpl.invoke(DelegatingMethodAccessorImpl.java:25)
>         at java.lang.reflect.Method.invoke(Method.java:597)
>         at
> org.apache.maven.surefire.booter.ProviderFactory$ClassLoaderProxy.invoke(ProviderFactory.java:103)
>         at $Proxy0.invoke(Unknown Source)
>         at
> org.apache.maven.surefire.booter.SurefireStarter.invokeProvider(SurefireStarter.java:150)
>         at
> org.apache.maven.surefire.booter.SurefireStarter.runSuitesInProcess(SurefireStarter.java:91)
>         at
> org.apache.maven.surefire.booter.ForkedBooter.main(ForkedBooter.java:69)
>
>
> ________________________________________________________________________________
> Keith Wiley     [EMAIL PROTECTED]     keithwiley.com
+
Keith Wiley 2013-04-02, 16:57
+
Alexander Pivovarov 2013-04-01, 23:12
+
Keith Wiley 2013-04-01, 23:15
NEW: Monitor These Apps!
elasticsearch, apache solr, apache hbase, hadoop, redis, casssandra, amazon cloudwatch, mysql, memcached, apache kafka, apache zookeeper, apache storm, ubuntu, centOS, red hat, debian, puppet labs, java, senseiDB