Home | About | Sematext search-lucene.com search-hadoop.com
 Search Hadoop and all its subprojects:

Switch to Threaded View
Pig, mail # user - pig-0.9.1 "ant test": 67 test cases failed with sun-jdk(1.6.0_27-ea) and Ant 1.8.2


Copy link to this message
-
pig-0.9.1 "ant test": 67 test cases failed with sun-jdk(1.6.0_27-ea) and Ant 1.8.2
lulynn_2008 2011-11-17, 02:57
Hello all,
I run "ant test" to pig-0.9.1, and the following test cases failed. My questions are:
--Is there any jira for these failed test case?
--I assume all test cases should be passed for pig-0.9.1 released. Is this correct?
--If you can pass all test case, what is your environment(especially jdk version and ant version)?
Thank you.
    [junit] Test org.apache.pig.parser.TestErrorHandling FAILED

    [junit] Test org.apache.pig.parser.TestLogicalPlanGenerator FAILED

    [junit] Test org.apache.pig.parser.TestQueryParser FAILED

    [junit] Test org.apache.pig.test.TestAccumulator FAILED

    [junit] Test org.apache.pig.test.TestAlgebraicEval FAILED

    [junit] Test org.apache.pig.test.TestAlgebraicEvalLocal FAILED

    [junit] Test org.apache.pig.test.TestAlgebraicInstantiation FAILED

    [junit] Test org.apache.pig.test.TestBZip FAILED

    [junit] Test org.apache.pig.test.TestBatchAliases FAILED

    [junit] Test org.apache.pig.test.TestCollectedGroup FAILED

    [junit] Test org.apache.pig.test.TestCombiner FAILED

    [junit] Test org.apache.pig.test.TestCommit FAILED

    [junit] Test org.apache.pig.test.TestDataBagAccess FAILED

    [junit] Test org.apache.pig.test.TestEvalPipeline FAILED

    [junit] Test org.apache.pig.test.TestEvalPipeline2 FAILED (timeout)

    [junit] Test org.apache.pig.test.TestEvalPipelineLocal FAILED

    [junit] Test org.apache.pig.test.TestExampleGenerator FAILED

    [junit] Test org.apache.pig.test.TestFilterOpNumeric FAILED

    [junit] Test org.apache.pig.test.TestFilterOpString FAILED

    [junit] Test org.apache.pig.test.TestFilterUDF FAILED

    [junit] Test org.apache.pig.test.TestFinish FAILED

    [junit] Test org.apache.pig.test.TestGrunt FAILED

    [junit] Test org.apache.pig.test.TestHBaseStorage FAILED

    [junit] Test org.apache.pig.test.TestImplicitSplit FAILED

    [junit] Test org.apache.pig.test.TestInfixArithmetic FAILED

    [junit] Test org.apache.pig.test.TestInputOutputFileValidator FAILED

    [junit] Test org.apache.pig.test.TestJobSubmission FAILED

    [junit] Test org.apache.pig.test.TestJoin FAILED

    [junit] Test org.apache.pig.test.TestLOLoadDeterminedSchema FAILED

    [junit] Test org.apache.pig.test.TestLocal FAILED

    [junit] Test org.apache.pig.test.TestLogToPhyCompiler FAILED

    [junit] Test org.apache.pig.test.TestLogicalPlanBuilder FAILED

    [junit] Test org.apache.pig.test.TestMRCompiler FAILED

    [junit] Test org.apache.pig.test.TestMacroExpansion FAILED

    [junit] Test org.apache.pig.test.TestMapReduce FAILED

    [junit] Test org.apache.pig.test.TestMapSideCogroup FAILED

    [junit] Test org.apache.pig.test.TestMergeJoin FAILED

    [junit] Test org.apache.pig.test.TestMergeJoinOuter FAILED

    [junit] Test org.apache.pig.test.TestMultiQuery FAILED

    [junit] Test org.apache.pig.test.TestMultiQueryBasic FAILED

    [junit] Test org.apache.pig.test.TestMultiQueryCompiler FAILED

    [junit] Test org.apache.pig.test.TestMultiQueryLocal FAILED

    [junit] Test org.apache.pig.test.TestNewPlanColumnPrune FAILED

    [junit] Test org.apache.pig.test.TestNewPlanImplicitSplit FAILED

    [junit] Test org.apache.pig.test.TestPartitionFilterPushDown FAILED

    [junit] Test org.apache.pig.test.TestPigContext FAILED

    [junit] Test org.apache.pig.test.TestPigRunner FAILED

    [junit] Test org.apache.pig.test.TestPigScriptParser FAILED

    [junit] Test org.apache.pig.test.TestPigServer FAILED

    [junit] Test org.apache.pig.test.TestPoissonSampleLoader FAILED

    [junit] Test org.apache.pig.test.TestPruneColumn FAILED

    [junit] Test org.apache.pig.test.TestRelationToExprProject FAILED

    [junit] Test org.apache.pig.test.TestSampleOptimizer FAILED

    [junit] Test org.apache.pig.test.TestScriptLanguage FAILED

    [junit] Test org.apache.pig.test.TestSecondarySort FAILED

    [junit] Test org.apache.pig.test.TestSkewedJoin FAILED (timeout)

    [junit] Test org.apache.pig.test.TestStore FAILED

    [junit] Test org.apache.pig.test.TestStreaming FAILED

    [junit] Test org.apache.pig.test.TestStreamingLocal FAILED

    [junit] Test org.apache.pig.test.TestTmpFileCompression FAILED

    [junit] Test org.apache.pig.test.TestToolsPigServer FAILED

    [junit] Test org.apache.pig.test.TestTypeCheckingValidatorNewLP FAILED

    [junit] Test org.apache.pig.test.TestUDF FAILED

    [junit] Test org.apache.pig.test.TestUDFContext FAILED

    [junit] Test org.apache.pig.test.TestUDFWithoutParameter FAILED

    [junit] Test org.apache.pig.test.TestUTF8 FAILED

[junit] Test org.apache.pig.test.pigunit.TestPigTest FAILED