Home | About | Sematext search-lucene.com search-hadoop.com
NEW: Monitor These Apps!
elasticsearch, apache solr, apache hbase, hadoop, redis, casssandra, amazon cloudwatch, mysql, memcached, apache kafka, apache zookeeper, apache storm, ubuntu, centOS, red hat, debian, puppet labs, java, senseiDB
 Search Hadoop and all its subprojects:

Switch to Threaded View
Zookeeper >> mail # dev >> RE: [VOTE] Release ZooKeeper 3.4.5 (candidate 0)


Copy link to this message
-
Re: [VOTE] Release ZooKeeper 3.4.5 (candidate 0)
I've seen that before, it's a flakey test that's unrelated to the sasl stuff.

Patrick

On Sat, Oct 6, 2012 at 2:25 PM, Ted Yu <[EMAIL PROTECTED]> wrote:
> I saw one test failure:
>
> https://builds.apache.org/view/S-Z/view/ZooKeeper/job/ZooKeeper_branch34_openjdk7/9/testReport/org.apache.zookeeper.server.quorum/QuorumPeerMainTest/testHighestZxidJoinLate/
>
> FYI
>
> On Sat, Oct 6, 2012 at 7:16 AM, Ted Yu <[EMAIL PROTECTED]> wrote:
>
>> Up in ZOOKEEPER-1557, Eugene separated one test out and test failure seems
>> to be gone.
>>
>> For ZooKeeper_branch34_jdk7, the two failed builds:
>> #10 corresponded to ZooKeeper_branch34_openjdk7 build #7,
>> #8 corresponded to ZooKeeper_branch34_openjdk7 build #5
>> where tests failed due to BindException
>>
>> Cheers
>>
>>
>> On Sat, Oct 6, 2012 at 7:06 AM, Patrick Hunt <[EMAIL PROTECTED]> wrote:
>>
>>> Yes. Those ubuntu machines have two slots each. If both tests run at
>>> the same time... bam.
>>>
>>> I just added exclusion locks to the configuration of these two jobs,
>>> that should help.
>>>
>>> Patrick
>>>
>>> On Fri, Oct 5, 2012 at 8:58 PM, Ted Yu <[EMAIL PROTECTED]> wrote:
>>> > I think that was due to the following running on the same machine at the
>>> > same time:
>>> >
>>> > Building remotely on ubuntu4
>>> > <https://builds.apache.org/computer/ubuntu4> in workspace
>>> > /home/jenkins/jenkins-slave/workspace/ZooKeeper_branch34_openjdk7
>>> >
>>> > We should introduce randomized port so that test suite can execute in
>>> > parallel.
>>> >
>>> > Cheers
>>> >
>>> > On Fri, Oct 5, 2012 at 8:55 PM, Ted Yu <[EMAIL PROTECTED]> wrote:
>>> >
>>> >> Some tests failed in build 8 due to (See
>>> >>
>>> >>
>>> https://builds.apache.org//view/S-Z/view/ZooKeeper/job/ZooKeeper_branch34_jdk7/8/testReport/org.apache.zookeeper.server/ZxidRolloverTest/testRolloverThenRestart/
>>> ):
>>> >>
>>> >> java.lang.RuntimeException: java.net.BindException: Address already in
>>> use
>>> >>       at
>>> org.apache.zookeeper.test.QuorumUtil.<init>(QuorumUtil.java:118)
>>> >>       at
>>> org.apache.zookeeper.server.ZxidRolloverTest.setUp(ZxidRolloverTest.java:63)
>>> >> Caused by: java.net.BindException: Address already in use
>>> >>       at sun.nio.ch.Net.bind0(Native Method)
>>> >>       at sun.nio.ch.Net.bind(Net.java:344)
>>> >>       at sun.nio.ch.Net.bind(Net.java:336)
>>> >>       at
>>> sun.nio.ch.ServerSocketChannelImpl.bind(ServerSocketChannelImpl.java:199)
>>> >>       at
>>> sun.nio.ch.ServerSocketAdaptor.bind(ServerSocketAdaptor.java:74)
>>> >>       at
>>> sun.nio.ch.ServerSocketAdaptor.bind(ServerSocketAdaptor.java:67)
>>> >>       at
>>> org.apache.zookeeper.server.NIOServerCnxnFactory.configure(NIOServerCnxnFactory.java:95)
>>> >>       at
>>> org.apache.zookeeper.server.ServerCnxnFactory.createFactory(ServerCnxnFactory.java:125)
>>> >>       at
>>> org.apache.zookeeper.server.quorum.QuorumPeer.<init>(QuorumPeer.java:517)
>>> >>       at
>>> org.apache.zookeeper.test.QuorumUtil.<init>(QuorumUtil.java:113)
>>> >>
>>> >>
>>> >>
>>> >> On Fri, Oct 5, 2012 at 9:56 AM, Patrick Hunt <[EMAIL PROTECTED]> wrote:
>>> >>
>>> >>> fwiw: I setup jdk7 and openjdk7 jobs last night for branch34 on
>>> >>> jenkins and they are looking good so far:
>>> >>>
>>> >>>
>>> >>>
>>> https://builds.apache.org//view/S-Z/view/ZooKeeper/job/ZooKeeper_branch34_jdk7/
>>> >>>
>>> >>>
>>> https://builds.apache.org//view/S-Z/view/ZooKeeper/job/ZooKeeper_branch34_openjdk7/
>>> >>>
>>> >>> Patrick
>>> >>>
>>> >>> On Thu, Oct 4, 2012 at 11:17 PM, Patrick Hunt <[EMAIL PROTECTED]>
>>> wrote:
>>> >>> > Doesn't look good, failed a second time:
>>> >>> >
>>> >>> >
>>> >>>
>>> https://builds.apache.org/view/S-Z/view/ZooKeeper/job/ZooKeeper-trunk-jdk7/408/
>>> >>> >
>>> >>> > java.util.concurrent.TimeoutException: Did not connect
>>> >>> >         at
>>> >>>
>>> org.apache.zookeeper.test.ClientBase$CountdownWatcher.waitForConnected(ClientBase.java:129)
>>> >>> >         at
>>> >>>
>>> org.apache.zookeeper.test.WatcherTest.testWatchAutoResetWithPending(WatcherTest.java:199)
NEW: Monitor These Apps!
elasticsearch, apache solr, apache hbase, hadoop, redis, casssandra, amazon cloudwatch, mysql, memcached, apache kafka, apache zookeeper, apache storm, ubuntu, centOS, red hat, debian, puppet labs, java, senseiDB