Home | About | Sematext search-lucene.com search-hadoop.com
 Search Hadoop and all its subprojects:

Switch to Threaded View
HBase >> mail # dev >> Re: Build failed in Jenkins: HBase-TRUNK #3498


Copy link to this message
-
Re: Build failed in Jenkins: HBase-TRUNK-on-Hadoop-2.0.0 #353
Hi,
Yesterday I noticed that large tests were not enabled for
HBase-TRUNK-on-Hadoop-2.0.0<https://builds.apache.org/job/HBase-TRUNK-on-Hadoop-2.0.0/353/>
 build.

There were some test failures after enabling large tests.

I will file JIRAs for reproducible test failures.

Cheers

On Thu, Jan 17, 2013 at 6:13 AM, Apache Jenkins Server <
[EMAIL PROTECTED]> wrote:

> See <https://builds.apache.org/job/HBase-TRUNK-on-Hadoop-2.0.0/353/>
>
> Results :
>
> Failed tests:
> testPermissionsWatcher(org.apache.hadoop.hbase.security.access.TestZKPermissionsWatcher)
>
> testHTableMultiplexer(org.apache.hadoop.hbase.client.TestHTableMultiplexer):
> expected:<0> but was:<1>
>
> testRegionShouldNotBeDeployed(org.apache.hadoop.hbase.util.TestHBaseFsck):
> expected:<[SHOULD_NOT_BE_DEPLOYED]> but was:<[]>
>
> Tests in error:
>   loadTest[0](org.apache.hadoop.hbase.util.TestMiniClusterLoadParallel):
> test timed out after 120000 milliseconds
>   loadTest[1](org.apache.hadoop.hbase.util.TestMiniClusterLoadParallel):
> test timed out after 120000 milliseconds
>   loadTest[0](org.apache.hadoop.hbase.util.TestMiniClusterLoadSequential):
> test timed out after 120000 milliseconds
>   loadTest[1](org.apache.hadoop.hbase.util.TestMiniClusterLoadSequential):
> test timed out after 120000 milliseconds
>
> testJoinedScanners(org.apache.hadoop.hbase.regionserver.TestJoinedScanners):
> Failed 20 actions: ExecutionException: 20 times,
>
> testLogRollOnDatanodeDeath(org.apache.hadoop.hbase.regionserver.wal.TestLogRolling):
> cannot get log writer
>
> testExportScannerBatching(org.apache.hadoop.hbase.mapreduce.TestImportExport)
>
> Tests run: 1267, Failures: 3, Errors: 7, Skipped: 13
>
> [INFO]
> [INFO]
> ------------------------------------------------------------------------
> [INFO] Skipping HBase
> [INFO] This project has been banned from the build due to previous
> failures.
> [INFO]
> ------------------------------------------------------------------------
> [INFO]
> ------------------------------------------------------------------------
> [INFO] Reactor Summary:
> [INFO]
> [INFO] HBase ............................................. SUCCESS
> [18.081s]
> [INFO] HBase - Common .................................... SUCCESS
> [25.178s]
> [INFO] HBase - Protocol .................................. SUCCESS
> [15.807s]
> [INFO] HBase - Client .................................... SUCCESS [1.102s]
> [INFO] HBase - Hadoop Compatibility ...................... SUCCESS [0.643s]
> [INFO] HBase - Hadoop Two Compatibility .................. SUCCESS [4.502s]
> [INFO] HBase - Server .................................... FAILURE
> [1:12:50.136s]
> [INFO] HBase - Hadoop One Compatibility .................. SKIPPED
> [INFO] HBase - Integration Tests ......................... SKIPPED
> [INFO] HBase - Examples .................................. SKIPPED
> [INFO]
> ------------------------------------------------------------------------
> [INFO] BUILD FAILURE
> [INFO]
> ------------------------------------------------------------------------
> [INFO] Total time: 1:14:02.617s
> [INFO] Finished at: Thu Jan 17 14:12:12 UTC 2013
> [INFO] Final Memory: 98M/552M
> [INFO]
> ------------------------------------------------------------------------
> [ERROR] Failed to execute goal
> org.apache.maven.plugins:maven-surefire-plugin:2.12-TRUNK-HBASE-2:test
> (secondPartTestsExecution) on project hbase-server: Failure or timeout ->
> [Help 1]
> org.apache.maven.lifecycle.LifecycleExecutionException: Failed to execute
> goal org.apache.maven.plugins:maven-surefire-plugin:2.12-TRUNK-HBASE-2:test
> (secondPartTestsExecution) on project hbase-server: Failure or timeout
>         at
> org.apache.maven.lifecycle.internal.MojoExecutor.execute(MojoExecutor.java:217)
>         at
> org.apache.maven.lifecycle.internal.MojoExecutor.execute(MojoExecutor.java:153)
>         at
> org.apache.maven.lifecycle.internal.MojoExecutor.execute(MojoExecutor.java:145)
>         at
> org.apache.maven.lifecycle.internal.LifecycleModuleBuilder.buildProject(LifecycleModuleBuilder.java:84)