Home | About | Sematext search-lucene.com search-hadoop.com
 Search Hadoop and all its subprojects:

Switch to Threaded View
Pig >> mail # dev >> Re: Build failed in Hudson: Pig-trunk #932


Copy link to this message
-
Re: Build failed in Hudson: Pig-trunk #932
So the build failed and it was already failing.
How do I know if I broke something ? From the build output it seems the contrib is not compiling.
Am I correct ?
Shouldn't we split those builds ?
Julien

On 2/24/11 2:11 AM, "Apache Hudson Server" <[EMAIL PROTECTED]> wrote:

See <https://hudson.apache.org/hudson/job/Pig-trunk/932/changes>

Changes:

[julien] PIG-1794: Javascript support for Pig embedding and UDFs in scripting languages

------------------------------------------
[...truncated 5349 lines...]
findbugs:
    [mkdir] Created dir: <https://hudson.apache.org/hudson/job/Pig-trunk/ws/trunk/build/test/findbugs>
 [findbugs] Executing findbugs from ant task
 [findbugs] Running FindBugs...
 [findbugs] Out of memory
 [findbugs] Total memory: 477M
 [findbugs]  free memory: 59M
 [findbugs] Analyzed: <https://hudson.apache.org/hudson/job/Pig-trunk/ws/trunk/build/pig-2011-02-24_10-06-13-core.jar>
 [findbugs]      Aux: <https://hudson.apache.org/hudson/job/Pig-trunk/ws/trunk/lib/automaton.jar>
 [findbugs]      Aux: <https://hudson.apache.org/hudson/job/Pig-trunk/ws/trunk/lib/hbase-0.20.6-test.jar>
 [findbugs]      Aux: <https://hudson.apache.org/hudson/job/Pig-trunk/ws/trunk/lib/hbase-0.20.6.jar>
 [findbugs]      Aux: <https://hudson.apache.org/hudson/job/Pig-trunk/ws/trunk/lib/zookeeper-hbase-1329.jar>
 [findbugs] Exception in thread "main" java.lang.OutOfMemoryError: GC overhead limit exceeded
 [findbugs]     at java.util.ArrayList.<init>(ArrayList.java:112)
 [findbugs]     at edu.umd.cs.findbugs.ba.Frame.<init>(Frame.java:110)
 [findbugs]     at edu.umd.cs.findbugs.ba.npe.IsNullValueFrame.<init>(IsNullValueFrame.java:74)
 [findbugs]     at edu.umd.cs.findbugs.ba.npe.IsNullValueAnalysis.createFact(IsNullValueAnalysis.java:208)
 [findbugs]     at edu.umd.cs.findbugs.ba.npe.IsNullValueAnalysis.createFact(IsNullValueAnalysis.java:72)
 [findbugs]     at edu.umd.cs.findbugs.ba.BasicAbstractDataflowAnalysis.lookupOrCreateFact(BasicAbstractDataflowAnalysis.java:156)
 [findbugs]     at edu.umd.cs.findbugs.ba.BasicAbstractDataflowAnalysis.getResultFact(BasicAbstractDataflowAnalysis.java:69)
 [findbugs]     at edu.umd.cs.findbugs.ba.Dataflow.<init>(Dataflow.java:82)
 [findbugs]     at edu.umd.cs.findbugs.ba.AbstractDataflow.<init>(AbstractDataflow.java:42)
 [findbugs]     at edu.umd.cs.findbugs.ba.npe.IsNullValueDataflow.<init>(IsNullValueDataflow.java:29)
 [findbugs]     at edu.umd.cs.findbugs.classfile.engine.bcel.IsNullValueDataflowFactory.analyze(IsNullValueDataflowFactory.java:74)
 [findbugs]     at edu.umd.cs.findbugs.classfile.engine.bcel.IsNullValueDataflowFactory.analyze(IsNullValueDataflowFactory.java:44)
 [findbugs]     at edu.umd.cs.findbugs.classfile.impl.AnalysisCache.analyzeMethod(AnalysisCache.java:332)
 [findbugs]     at edu.umd.cs.findbugs.classfile.impl.AnalysisCache.getMethodAnalysis(AnalysisCache.java:282)
 [findbugs]     at edu.umd.cs.findbugs.ba.ClassContext.getMethodAnalysis(ClassContext.java:942)
 [findbugs]     at edu.umd.cs.findbugs.ba.ClassContext.getIsNullValueDataflow(ClassContext.java:371)
 [findbugs]     at edu.umd.cs.findbugs.detect.BuildNonnullReturnDatabase.analyzeMethod(BuildNonnullReturnDatabase.java:77)
 [findbugs]     at edu.umd.cs.findbugs.detect.BuildNonnullReturnDatabase.considerMethod(BuildNonnullReturnDatabase.java:66)
 [findbugs]     at edu.umd.cs.findbugs.detect.BuildNonnullReturnDatabase.visitClassContext(BuildNonnullReturnDatabase.java:59)
 [findbugs]     at edu.umd.cs.findbugs.DetectorToDetector2Adapter.visitClass(DetectorToDetector2Adapter.java:68)
 [findbugs]     at edu.umd.cs.findbugs.FindBugs2.analyzeApplication(FindBugs2.java:979)
 [findbugs]     at edu.umd.cs.findbugs.FindBugs2.execute(FindBugs2.java:230)
 [findbugs]     at edu.umd.cs.findbugs.FindBugs.runMain(FindBugs.java:348)
 [findbugs]     at edu.umd.cs.findbugs.FindBugs2.main(FindBugs2.java:1057)
 [findbugs] Java Result: 1
 [findbugs] Output saved to <https://hudson.apache.org/hudson/job/Pig-trunk/ws/trunk/build/test/findbugs/pig-findbugs-report.xml>
     [xslt] Processing <https://hudson.apache.org/hudson/job/Pig-trunk/ws/trunk/build/test/findbugs/pig-findbugs-report.xml> to <https://hudson.apache.org/hudson/job/Pig-trunk/ws/trunk/build/test/findbugs/pig-findbugs-report.html>
     [xslt] Loading stylesheet /homes/hudson/tools/findbugs/latest/src/xsl/default.xsl
     [xslt] : Error! Premature end of file.
     [xslt] : Error! com.sun.org.apache.xml.internal.utils.WrappedRuntimeException: Premature end of file.
     [xslt] Failed to process <https://hudson.apache.org/hudson/job/Pig-trunk/ws/trunk/build/test/findbugs/pig-findbugs-report.xml>

BUILD FAILED
javax.xml.transform.TransformerException: javax.xml.transform.TransformerException: com.sun.org.apache.xml.internal.utils.WrappedRuntimeException: Premature end of file.
        at com.sun.org.apache.xalan.internal.xsltc.trax.TransformerImpl.transform(TransformerImpl.java:719)
        at com.sun.org.apache.xalan.internal.xsltc.trax.TransformerImpl.transform(TransformerImpl.java:313)
        at org.apache.tools.ant.taskdefs.optional.TraXLiaison.transform(TraXLiaison.java:187)
        at org.apache.tools.ant.taskdefs.XSLTProcess.process(XSLTProcess.java:709)
        at org.apache.tools.ant.taskdefs.XSLTProcess.execute(XSLTProcess.java:333)
        at org.apache.tools.ant.UnknownElement.execute(UnknownElement.java:288)
        at sun.reflect.GeneratedMethodAccessor1.invoke(Unknown Source)
        at sun.reflect.DelegatingMethodAccessorImpl.invoke(DelegatingMethodAccessorImpl.java:25)
        at java.lang.reflect.Method.invoke(Method.java:597)
        at org.apache.tools.ant.dispatch.DispatchUtils.execute(DispatchUtils.java:106)
        at org.apache.tools.ant.Task.perform(Task.java:348)
        at org.apache.tools.ant.Target.execute(Target.java:357)
        at org.apache.tools.ant.Target.performTasks(Target.java:385)
        at org.apache.tools.ant.Project.executeSortedTargets(Project.java:1337)
        at org.apache.tools.ant.Project.e