Home | About | Sematext search-lucene.com search-hadoop.com
 Search Hadoop and all its subprojects:

Switch to Threaded View
HBase, mail # dev - Re: Build failed in Jenkins: HBase-TRUNK #3498


Copy link to this message
-
Re: Build failed in Jenkins: HBase-TRUNK #3498
Ted Yu 2012-10-30, 20:56
I looped the failed test locally five times and didn't see failure.

On Tue, Oct 30, 2012 at 1:36 PM, Apache Jenkins Server <
[EMAIL PROTECTED]> wrote:

> See <https://builds.apache.org/job/HBase-TRUNK/3498/changes>
>
> Changes:
>
> [tedyu] HBASE-7055 port HBASE-6371 tier-based compaction from 0.89-fb to
> trunk (Sergey)
>
> [tedyu] HBASE-7060 Region load balancing by table does not handle the case
> where a table's region count is lower than the number of the RS in the
> cluster (Ted Yu and Tianying)
>
> ...
> Results :
>
> Failed tests:
> testDuplicateVersions(org.apache.hadoop.hbase.regionserver.TestColumnSeeking):
> expected:<0> but was:<200>
>
> Tests run: 599, Failures: 1, Errors: 0, Skipped: 0
>
> [INFO]
> [INFO]
> ------------------------------------------------------------------------
> [INFO] Skipping HBase
> [INFO] This project has been banned from the build due to previous
> failures.
> [INFO]
> ------------------------------------------------------------------------
> [INFO]
> [INFO]
> ------------------------------------------------------------------------
> [INFO] Skipping HBase
> [INFO] This project has been banned from the build due to previous
> failures.
> [INFO]
> ------------------------------------------------------------------------
> [INFO]
> ------------------------------------------------------------------------
> [INFO] Reactor Summary:
> [INFO]
> [INFO] HBase ............................................. SUCCESS [6.163s]
> [INFO] HBase - Common .................................... SUCCESS
> [14.985s]
> [INFO] HBase - Hadoop Compatibility ...................... SUCCESS [0.689s]
> [INFO] HBase - Hadoop One Compatibility .................. SUCCESS [1.585s]
> [INFO] HBase - Server .................................... FAILURE
> [1:34.982s]
> [INFO] HBase - Hadoop Two Compatibility .................. SKIPPED
> [INFO] HBase - Integration Tests ......................... SKIPPED
> [INFO]
> ------------------------------------------------------------------------
> [INFO] BUILD FAILURE
> [INFO]
> ------------------------------------------------------------------------
> [INFO] Total time: 1:59.230s
> [INFO] Finished at: Tue Oct 30 20:36:02 UTC 2012
> [INFO] Final Memory: 52M/577M
> [INFO]
> ------------------------------------------------------------------------
> [ERROR] Failed to execute goal
> org.apache.maven.plugins:maven-surefire-plugin:2.12-TRUNK-HBASE-2:test
> (default-test) on project hbase-server: There are test failures.
> [ERROR]
> [ERROR] Please refer to <
> https://builds.apache.org/job/HBase-TRUNK/ws/trunk/hbase-server/target/surefire-reports>
> for the individual test results.
> [ERROR] -> [Help 1]
> [ERROR]
> [ERROR] To see the full stack trace of the errors, re-run Maven with the
> -e switch.
> [ERROR] Re-run Maven using the -X switch to enable full debug logging.
> [ERROR]
> [ERROR] For more information about the errors and possible solutions,
> please read the following articles:
> [ERROR] [Help 1]
> http://cwiki.apache.org/confluence/display/MAVEN/MojoFailureException
> [ERROR]
> [ERROR] After correcting the problems, you can resume the build with the
> command
> [ERROR]   mvn <goals> -rf :hbase-server
> Build step 'Invoke top-level Maven targets' marked build as failure
> Archiving artifacts
> Recording test results
> Updating HBASE-7060
> Updating HBASE-7055
> Updating HBASE-6371
>