Home | About | Sematext search-lucene.com search-hadoop.com
 Search Hadoop and all its subprojects:

Switch to Plain View
Flume, mail # dev - HDFS sink test failure


Copy link to this message
-
HDFS sink test failure
Roshan Naik 2013-08-16, 01:31
I am seeing the following test failing consistent on centos5/6 and suse11.
This  Flume 1.4  against Hadoop version 2.1.0.  Thoughts ?:

Running org.apache.flume.sink.hdfs.TestHDFSEventSinkOnMiniCluster
Tests run: 4, Failures: 1, Errors: 0, Skipped: 0, Time elapsed: 20.998 sec
<<< FAILURE!
maxUnderReplicationTest(org.apache.flume.sink.hdfs.TestHDFSEventSinkOnMiniCluster)
 Time elapsed: 4428 sec  <<< FAILURE!
java.lang.AssertionError: 31 files expected, found 32 expected:<31> but
was:<32>
        at org.junit.Assert.fail(Assert.java:93)
        at org.junit.Assert.failNotEquals(Assert.java:647)
        at org.junit.Assert.assertEquals(Assert.java:128)
        at org.junit.Assert.assertEquals(Assert.java:472)
        at
org.apache.flume.sink.hdfs.TestHDFSEventSinkOnMiniCluster.maxUnderReplicationTest(TestHDFSEventSinkOnMiniCluster.java:462)
        at sun.reflect.NativeMethodAccessorImpl.invoke0(Native Method)
        at
sun.reflect.NativeMethodAccessorImpl.invoke(NativeMethodAccessorImpl.java:57)
        at
sun.reflect.DelegatingMethodAccessorImpl.invoke(DelegatingMethodAccessorImpl.java:43)
        at java.lang.reflect.Method.invoke(Method.java:616)
        at
org.junit.runners.model.FrameworkMethod$1.runReflectiveCall(FrameworkMethod.java:45)
        at
org.junit.internal.runners.model.ReflectiveCallable.run(ReflectiveCallable.java:15)
        at
org.junit.runners.model.FrameworkMethod.invokeExplosively(FrameworkMethod.java:42)
        at
org.junit.internal.runners.statements.InvokeMethod.evaluate(InvokeMethod.java:20)
        at org.junit.runners.ParentRunner.runLeaf(ParentRunner.java:263)
        at
org.junit.runners.BlockJUnit4ClassRunner.runChild(BlockJUnit4ClassRunner.java:68)
        at
org.junit.runners.BlockJUnit4ClassRunner.runChild(BlockJUnit4ClassRunner.java:47)
        at org.junit.runners.ParentRunner$3.run(ParentRunner.java:231)
        at org.junit.runners.ParentRunner$1.schedule(ParentRunner.java:60)
        at org.junit.runners.ParentRunner.runChildren(ParentRunner.java:229)
        at org.junit.runners.ParentRunner.access$000(ParentRunner.java:50)
        at org.junit.runners.ParentRunner$2.evaluate(ParentRunner.java:222)
        at
org.junit.internal.runners.statements.RunBefores.evaluate(RunBefores.java:28)
        at
org.junit.internal.runners.statements.RunAfters.evaluate(RunAfters.java:30)
        at org.junit.runners.ParentRunner.run(ParentRunner.java:300)
        at
org.apache.maven.surefire.junit4.JUnit4Provider.execute(JUnit4Provider.java:252)
        at
org.apache.maven.surefire.junit4.JUnit4Provider.executeTestSet(JUnit4Provider.java:141)
        at
org.apache.maven.surefire.junit4.JUnit4Provider.invoke(JUnit4Provider.java:112)
        at sun.reflect.NativeMethodAccessorImpl.invoke0(Native Method)
        at
sun.reflect.NativeMethodAccessorImpl.invoke(NativeMethodAccessorImpl.java:57)
        at
sun.reflect.DelegatingMethodAccessorImpl.invoke(DelegatingMethodAccessorImpl.java:43)
        at java.lang.reflect.Method.invoke(Method.java:616)
        at
org.apache.maven.surefire.util.ReflectionUtils.invokeMethodWithArray(ReflectionUtils.java:189)
        at
org.apache.maven.surefire.booter.ProviderFactory$ProviderProxy.invoke(ProviderFactory.java:165)
        at
org.apache.maven.surefire.booter.ProviderFactory.invokeProvider(ProviderFactory.java:85)
        at
org.apache.maven.surefire.booter.ForkedBooter.runSuitesInProcess(ForkedBooter.java:115)
        at
org.apache.maven.surefire.booter.ForkedBooter.main(ForkedBooter.java:75)

--
CONFIDENTIALITY NOTICE
NOTICE: This message is intended for the use of the individual or entity to
which it is addressed and may contain information that is confidential,
privileged and exempt from disclosure under applicable law. If the reader
of this message is not the intended recipient, you are hereby notified that
any printing, copying, dissemination, distribution, disclosure or
forwarding of this communication is strictly prohibited. If you have
received this communication in error, please contact the sender immediately
and delete it from your system. Thank You.