Home | About | Sematext search-lucene.com search-hadoop.com
 Search Hadoop and all its subprojects:

Switch to Threaded View
HBase >> mail # dev >> Re: Build failed in Jenkins: HBase-TRUNK #3498


Copy link to this message
-
Re: Build failed in Jenkins: hbase-0.95 #45
These are all timeouts.
St.Ack
On Fri, Mar 8, 2013 at 7:49 PM, Apache Jenkins Server <
[EMAIL PROTECTED]> wrote:

> See <https://builds.apache.org/job/hbase-0.95/45/>
>
> ------------------------------------------
> [...truncated 3757 lines...]
> Tests run: 3, Failures: 0, Errors: 0, Skipped: 0, Time elapsed: 6.326 sec
> Running org.apache.hadoop.hbase.regionserver.TestMemStore
> Tests run: 22, Failures: 0, Errors: 0, Skipped: 0, Time elapsed: 53.284 sec
> Running org.apache.hadoop.hbase.regionserver.TestSplitTransactionOnCluster
> Tests run: 9, Failures: 0, Errors: 2, Skipped: 0, Time elapsed: 382.332
> sec <<< FAILURE!
> Running org.apache.hadoop.hbase.regionserver.handler.TestOpenRegionHandler
> Tests run: 5, Failures: 0, Errors: 0, Skipped: 0, Time elapsed: 52.839 sec
> Running org.apache.hadoop.hbase.regionserver.handler.TestCloseRegionHandler
> Tests run: 3, Failures: 0, Errors: 0, Skipped: 0, Time elapsed: 54.927 sec
> Running org.apache.hadoop.hbase.regionserver.TestMultiColumnScanner
> Tests run: 12, Failures: 0, Errors: 0, Skipped: 0, Time elapsed: 314.854
> sec
> Running org.apache.hadoop.hbase.regionserver.TestMasterAddressManager
> Tests run: 1, Failures: 0, Errors: 0, Skipped: 0, Time elapsed: 10.638 sec
> Running org.apache.hadoop.hbase.regionserver.TestSplitLogWorker
> Tests run: 5, Failures: 1, Errors: 0, Skipped: 0, Time elapsed: 17.837 sec
> <<< FAILURE!
> Running
> org.apache.hadoop.hbase.regionserver.TestRSKilledWhenMasterInitializing
> Running org.apache.hadoop.hbase.regionserver.TestHRegionServerBulkLoad
> Tests run: 1, Failures: 0, Errors: 0, Skipped: 0, Time elapsed: 113.465 sec
> Running org.apache.hadoop.hbase.regionserver.TestSeekOptimizations
> Tests run: 6, Failures: 0, Errors: 0, Skipped: 0, Time elapsed: 37.384 sec
> Tests run: 1, Failures: 0, Errors: 0, Skipped: 0, Time elapsed: 113.933 sec
> Running org.apache.hadoop.hbase.regionserver.TestFSErrorsExposed
> Running org.apache.hadoop.hbase.regionserver.TestPriorityRpc
> Tests run: 3, Failures: 0, Errors: 0, Skipped: 1, Time elapsed: 11.248 sec
> Tests run: 3, Failures: 0, Errors: 0, Skipped: 0, Time elapsed: 13.192 sec
> Running org.apache.hadoop.hbase.regionserver.TestCompactionState
> Running org.apache.hadoop.hbase.filter.TestColumnRangeFilter
> Tests run: 1, Failures: 0, Errors: 0, Skipped: 0, Time elapsed: 335.698 sec
> Tests run: 5, Failures: 0, Errors: 2, Skipped: 0, Time elapsed: 355.642
> sec <<< FAILURE!
> Running org.apache.hadoop.hbase.security.token.TestTokenAuthentication
> Tests run: 2, Failures: 0, Errors: 0, Skipped: 0, Time elapsed: 16.291 sec
> Running org.apache.hadoop.hbase.security.token.TestZKSecretWatcher
> Tests run: 1, Failures: 0, Errors: 0, Skipped: 0, Time elapsed: 67.014 sec
> Running org.apache.hadoop.hbase.filter.TestFilterWrapper
> Running org.apache.hadoop.hbase.filter.TestFilterWithScanLimits
> Tests run: 1, Failures: 0, Errors: 0, Skipped: 0, Time elapsed: 153.123 sec
> Tests run: 1, Failures: 0, Errors: 0, Skipped: 0, Time elapsed: 153.907 sec
> Running org.apache.hadoop.hbase.TestGlobalMemStoreSize
> Tests run: 1, Failures: 0, Errors: 0, Skipped: 0, Time elapsed: 175.542 sec
> Running org.apache.hadoop.hbase.security.access.TestZKPermissionsWatcher
> Tests run: 1, Failures: 0, Errors: 0, Skipped: 0, Time elapsed: 119.156 sec
> Running org.apache.hadoop.hbase.security.access.TestAccessControlFilter
> Tests run: 1, Failures: 0, Errors: 0, Skipped: 0, Time elapsed: 141.166 sec
> Running org.apache.hadoop.hbase.security.access.TestTablePermissions
> Tests run: 7, Failures: 0, Errors: 0, Skipped: 0, Time elapsed: 209.65 sec
> Running org.apache.hadoop.hbase.TestHBaseTestingUtility
> Tests run: 7, Failures: 0, Errors: 1, Skipped: 0, Time elapsed: 431.833
> sec <<< FAILURE!
> Running org.apache.hadoop.hbase.TestMultiVersions
> Tests run: 3, Failures: 0, Errors: 0, Skipped: 0, Time elapsed: 193.451 sec
> Running org.apache.hadoop.hbase.replication.TestReplicationZookeeper
> Tests run: 4, Failures: 0, Errors: 0, Skipped: 0, Time elapsed: 11.664 sec