I followed all the directions but still am getting this error when I run
mvn package -DskipTests
[INFO] BUILD FAILURE

[INFO]
------------------------------------------------------------------------

[INFO] Total time: 3.890s

[INFO] Finished at: Tue Jun 12 11:27:30 PDT 2012

[INFO] Final Memory: 9M/27M

[INFO]
------------------------------------------------------------------------

[ERROR] Failed to execute goal
org.apache.thrift.tools:maven-thrift-plugin:0.1.10:compile (default) on
project flume-core: thrift did not exit cleanly. Review output for more
information. -> [Help 1]

[ERROR]

[ERROR] To see the full stack trace of the errors, re-run Maven with the -e
switch.

[ERROR] Re-run Maven using the -X switch to enable full debug logging.
On Tue, Jun 12, 2012 at 11:02 AM, Will McQueen <[EMAIL PROTECTED]> wrote:
NEW: Monitor These Apps!
elasticsearch, apache solr, apache hbase, hadoop, redis, casssandra, amazon cloudwatch, mysql, memcached, apache kafka, apache zookeeper, apache storm, ubuntu, centOS, red hat, debian, puppet labs, java, senseiDB