Home | About | Sematext search-lucene.com search-hadoop.com
NEW: Monitor These Apps!
elasticsearch, apache solr, apache hbase, hadoop, redis, casssandra, amazon cloudwatch, mysql, memcached, apache kafka, apache zookeeper, apache storm, ubuntu, centOS, red hat, debian, puppet labs, java, senseiDB
 Search Hadoop and all its subprojects:

Switch to Plain View
Hadoop >> mail # user >> Why hadoop 0.20.203 unit test failed


Copy link to this message
-
Why hadoop 0.20.203 unit test failed
Hi all,

I'm trying to compile and unit testing hadoop 0.20.203, but met with almost
the same problem with previous discussion in the mailing list(
http://mail-archives.apache.org/mod_mbox/hadoop-general/201105.mbox/%[EMAIL PROTECTED]%3E).
Even after setting umask to 022, I still have 11 testcases failed, as listed
below.

Test org.apache.hadoop.mapred.TestJobTrackerRestart FAILED
Test org.apache.hadoop.mapred.TestJobTrackerRestartWithLostTracker FAILED
Test org.apache.hadoop.mapred.TestJobTrackerSafeMode FAILED
Test org.apache.hadoop.filecache.TestMRWithDistributedCache FAILED
Test org.apache.hadoop.filecache.TestTrackerDistributedCacheManager FAILED
Test org.apache.hadoop.mapred.TestMiniMRMapRedDebugScript FAILED
Test org.apache.hadoop.mapred.TestRecoveryManager FAILED
Test org.apache.hadoop.mapred.TestTaskTrackerLocalization FAILED
Test org.apache.hadoop.mapred.lib.TestCombineFileInputFormat FAILED
Test org.apache.hadoop.metrics2.impl.TestMetricsSystemImpl FAILED
Test org.apache.hadoop.tools.rumen.TestRumenJobTraces FAILED
Test org.apache.hadoop.hdfsproxy.TestHdfsProxy FAILED

The jdk version in my testing environment is Sun jdk 1.6u19, and the ant
version is 1.8.2

Anybody knows what causes these testcase failure? Any comments/suggestion
would be highly appreciated.

--
Best Regards,
Li Yu
NEW: Monitor These Apps!
elasticsearch, apache solr, apache hbase, hadoop, redis, casssandra, amazon cloudwatch, mysql, memcached, apache kafka, apache zookeeper, apache storm, ubuntu, centOS, red hat, debian, puppet labs, java, senseiDB