Home | About | Sematext search-lucene.com search-hadoop.com
 Search Hadoop and all its subprojects:

Switch to Threaded View
HBase >> mail # dev >> Re: Build failed in Jenkins: HBase-TRUNK #3498


Copy link to this message
-
Re: Build failed in Jenkins: HBase-TRUNK-Hadoop-2 #226
< Running org.apache.hadoop.hbase.mapreduce.TestHFileOutputFormat
< Running org.apache.hadoop.hbase.mapreduce.TestImportExport
< Running org.apache.hadoop.hbase.mapreduce.TestImportTsv
< Running org.apache.hadoop.hbase.mapreduce.TestMultiTableInputFormat
< Running org.apache.hadoop.hbase.mapreduce.TestRowCounter
< Running org.apache.hadoop.hbase.mapreduce.TestTableInputFormatScan1
< Running org.apache.hadoop.hbase.mapreduce.TestTableInputFormatScan2
< Running org.apache.hadoop.hbase.mapreduce.TestTableMapReduce
< Running org.apache.hadoop.hbase.TestZooKeeper

On Wed, May 8, 2013 at 2:52 AM, <[EMAIL PROTECTED]> wrote:

> See <http://54.241.6.143/job/HBase-TRUNK-Hadoop-2/226/>
>
> ------------------------------------------
> [...truncated 7613 lines...]
>         at java.lang.Thread.run(Thread.java:662)
> org.apache.maven.surefire.booter.SurefireBooterForkException: Error
> occurred in starting fork, check output in log
>         at
> org.apache.maven.plugin.surefire.booterclient.ForkStarter.fork(ForkStarter.java:238)
>         at
> org.apache.maven.plugin.surefire.booterclient.ForkStarter.access$000(ForkStarter.java:64)
>         at
> org.apache.maven.plugin.surefire.booterclient.ForkStarter$ParallelFork.call(ForkStarter.java:303)
>         at
> org.apache.maven.plugin.surefire.booterclient.ForkStarter$ParallelFork.call(ForkStarter.java:285)
>         at
> java.util.concurrent.FutureTask$Sync.innerRun(FutureTask.java:303)
>         at java.util.concurrent.FutureTask.run(FutureTask.java:138)
>         at
> java.util.concurrent.ThreadPoolExecutor$Worker.runTask(ThreadPoolExecutor.java:895)
>         at
> java.util.concurrent.ThreadPoolExecutor$Worker.run(ThreadPoolExecutor.java:918)
>         at java.lang.Thread.run(Thread.java:662)
> org.apache.maven.surefire.booter.SurefireBooterForkException: Error
> occurred in starting fork, check output in log
>         at
> org.apache.maven.plugin.surefire.booterclient.ForkStarter.fork(ForkStarter.java:238)
>         at
> org.apache.maven.plugin.surefire.booterclient.ForkStarter.access$000(ForkStarter.java:64)
>         at
> org.apache.maven.plugin.surefire.booterclient.ForkStarter$ParallelFork.call(ForkStarter.java:303)
>         at
> org.apache.maven.plugin.surefire.booterclient.ForkStarter$ParallelFork.call(ForkStarter.java:285)
>         at
> java.util.concurrent.FutureTask$Sync.innerRun(FutureTask.java:303)
>         at java.util.concurrent.FutureTask.run(FutureTask.java:138)
>         at
> java.util.concurrent.ThreadPoolExecutor$Worker.runTask(ThreadPoolExecutor.java:895)
>         at
> java.util.concurrent.ThreadPoolExecutor$Worker.run(ThreadPoolExecutor.java:918)
>         at java.lang.Thread.run(Thread.java:662)
> Running org.apache.hadoop.hbase.mapreduce.TestLoadIncrementalHFiles
> Tests run: 7, Failures: 0, Errors: 0, Skipped: 0, Time elapsed: 26.459 sec
> org.apache.maven.surefire.booter.SurefireBooterForkException: Error
> occurred in starting fork, check output in log
>         at
> org.apache.maven.plugin.surefire.booterclient.ForkStarter.fork(ForkStarter.java:238)
>         at
> org.apache.maven.plugin.surefire.booterclient.ForkStarter.access$000(ForkStarter.java:64)
>         at
> org.apache.maven.plugin.surefire.booterclient.ForkStarter$ParallelFork.call(ForkStarter.java:303)
>         at
> org.apache.maven.plugin.surefire.booterclient.ForkStarter$ParallelFork.call(ForkStarter.java:285)
>         at
> java.util.concurrent.FutureTask$Sync.innerRun(FutureTask.java:303)
>         at java.util.concurrent.FutureTask.run(FutureTask.java:138)
>         at
> java.util.concurrent.ThreadPoolExecutor$Worker.runTask(ThreadPoolExecutor.java:895)
>         at
> java.util.concurrent.ThreadPoolExecutor$Worker.run(ThreadPoolExecutor.java:918)
>         at java.lang.Thread.run(Thread.java:662)
> No results for java.util.concurrent.FutureTask@7f0264e0
> Running org.apache.hadoop.hbase.mapreduce.TestSecureLoadIncrementalHFiles
> Tests run: 7, Failures: 0, Errors: 0, Skipped: 0, Time elapsed: 35.72 sec

// Jonathan Hsieh (shay)
// Software Engineer, Cloudera
// [EMAIL PROTECTED]