Home | About | Sematext search-lucene.com search-hadoop.com
 Search Hadoop and all its subprojects:

Switch to Plain View
HBase >> mail # dev >> Re: Build failed in Jenkins: HBase-TRUNK #3498


+
Ted Yu 2012-10-30, 20:56
+
Ted Yu 2012-12-03, 03:44
+
lars hofhansl 2012-11-14, 02:05
+
lars hofhansl 2012-11-14, 19:55
+
Jimmy Xiang 2012-11-14, 20:12
+
lars hofhansl 2012-11-14, 20:18
+
Ted Yu 2012-11-14, 20:30
+
lars hofhansl 2012-11-14, 20:40
+
lars hofhansl 2012-11-17, 01:26
+
ramkrishna vasudevan 2012-11-17, 05:04
+
lars hofhansl 2012-12-31, 03:22
+
Stack 2012-12-19, 16:19
+
lars hofhansl 2012-12-28, 07:53
+
lars hofhansl 2012-12-28, 08:27
+
lars hofhansl 2012-12-29, 07:31
+
lars hofhansl 2012-12-29, 07:42
+
Stack 2012-12-26, 18:58
+
lars hofhansl 2012-12-26, 19:14
+
Stack 2012-12-26, 19:27
+
lars hofhansl 2012-12-26, 19:57
+
Ted Yu 2013-01-17, 15:17
Copy link to this message
-
Re: Build failed in Jenkins: HBase-TRUNK-on-Hadoop-2.0.0 #353
Hi Ted,

Most of those tests are failing locally too. For
testRegionShouldNotBeDeployed, there is already HBASE-7597 opened.

JM

2013/1/17, Ted Yu <[EMAIL PROTECTED]>:
> Hi,
> Yesterday I noticed that large tests were not enabled for
> HBase-TRUNK-on-Hadoop-2.0.0<https://builds.apache.org/job/HBase-TRUNK-on-Hadoop-2.0.0/353/>
>  build.
>
> There were some test failures after enabling large tests.
>
> I will file JIRAs for reproducible test failures.
>
> Cheers
>
> On Thu, Jan 17, 2013 at 6:13 AM, Apache Jenkins Server <
> [EMAIL PROTECTED]> wrote:
>
>> See <https://builds.apache.org/job/HBase-TRUNK-on-Hadoop-2.0.0/353/>
>>
>> Results :
>>
>> Failed tests:
>> testPermissionsWatcher(org.apache.hadoop.hbase.security.access.TestZKPermissionsWatcher)
>>
>> testHTableMultiplexer(org.apache.hadoop.hbase.client.TestHTableMultiplexer):
>> expected:<0> but was:<1>
>>
>> testRegionShouldNotBeDeployed(org.apache.hadoop.hbase.util.TestHBaseFsck):
>> expected:<[SHOULD_NOT_BE_DEPLOYED]> but was:<[]>
>>
>> Tests in error:
>>   loadTest[0](org.apache.hadoop.hbase.util.TestMiniClusterLoadParallel):
>> test timed out after 120000 milliseconds
>>   loadTest[1](org.apache.hadoop.hbase.util.TestMiniClusterLoadParallel):
>> test timed out after 120000 milliseconds
>>
>> loadTest[0](org.apache.hadoop.hbase.util.TestMiniClusterLoadSequential):
>> test timed out after 120000 milliseconds
>>
>> loadTest[1](org.apache.hadoop.hbase.util.TestMiniClusterLoadSequential):
>> test timed out after 120000 milliseconds
>>
>> testJoinedScanners(org.apache.hadoop.hbase.regionserver.TestJoinedScanners):
>> Failed 20 actions: ExecutionException: 20 times,
>>
>> testLogRollOnDatanodeDeath(org.apache.hadoop.hbase.regionserver.wal.TestLogRolling):
>> cannot get log writer
>>
>> testExportScannerBatching(org.apache.hadoop.hbase.mapreduce.TestImportExport)
>>
>> Tests run: 1267, Failures: 3, Errors: 7, Skipped: 13
>>
>> [INFO]
>> [INFO]
>> ------------------------------------------------------------------------
>> [INFO] Skipping HBase
>> [INFO] This project has been banned from the build due to previous
>> failures.
>> [INFO]
>> ------------------------------------------------------------------------
>> [INFO]
>> ------------------------------------------------------------------------
>> [INFO] Reactor Summary:
>> [INFO]
>> [INFO] HBase ............................................. SUCCESS
>> [18.081s]
>> [INFO] HBase - Common .................................... SUCCESS
>> [25.178s]
>> [INFO] HBase - Protocol .................................. SUCCESS
>> [15.807s]
>> [INFO] HBase - Client .................................... SUCCESS
>> [1.102s]
>> [INFO] HBase - Hadoop Compatibility ...................... SUCCESS
>> [0.643s]
>> [INFO] HBase - Hadoop Two Compatibility .................. SUCCESS
>> [4.502s]
>> [INFO] HBase - Server .................................... FAILURE
>> [1:12:50.136s]
>> [INFO] HBase - Hadoop One Compatibility .................. SKIPPED
>> [INFO] HBase - Integration Tests ......................... SKIPPED
>> [INFO] HBase - Examples .................................. SKIPPED
>> [INFO]
>> ------------------------------------------------------------------------
>> [INFO] BUILD FAILURE
>> [INFO]
>> ------------------------------------------------------------------------
>> [INFO] Total time: 1:14:02.617s
>> [INFO] Finished at: Thu Jan 17 14:12:12 UTC 2013
>> [INFO] Final Memory: 98M/552M
>> [INFO]
>> ------------------------------------------------------------------------
>> [ERROR] Failed to execute goal
>> org.apache.maven.plugins:maven-surefire-plugin:2.12-TRUNK-HBASE-2:test
>> (secondPartTestsExecution) on project hbase-server: Failure or timeout ->
>> [Help 1]
>> org.apache.maven.lifecycle.LifecycleExecutionException: Failed to execute
>> goal
>> org.apache.maven.plugins:maven-surefire-plugin:2.12-TRUNK-HBASE-2:test
>> (secondPartTestsExecution) on project hbase-server: Failure or timeout
>>         at
>> org.apache.maven.lifecycle.internal.MojoExecutor.execute(MojoExecutor.java:217)
+
lars hofhansl 2013-02-02, 05:53
+
Matteo Bertozzi 2013-03-04, 13:37
+
Stack 2013-03-04, 18:03
+
lars hofhansl 2013-03-05, 02:15
+
Stack 2013-03-07, 07:37
+
lars hofhansl 2013-03-07, 19:07
+
Stack 2013-03-08, 17:23
+
ramkrishna vasudevan 2013-03-08, 17:26
+
Matteo Bertozzi 2013-03-08, 17:40
+
Ted Yu 2013-03-08, 17:50
+
Stack 2013-03-08, 18:13
+
Stack 2013-03-09, 04:11
+
Stack 2013-03-09, 16:38
+
Ted Yu 2013-03-12, 04:36
+
Andrew Purtell 2013-03-12, 04:42
+
Ted Yu 2013-03-12, 04:50
+
ramkrishna vasudevan 2013-03-13, 17:51
+
Ted Yu 2013-03-13, 18:30
+
Vikas Jadhav 2013-03-12, 05:41
+
lars hofhansl 2013-03-12, 05:53
+
Ted Yu 2013-03-19, 14:29
+
Andrew Purtell 2013-03-19, 15:39
+
Ted Yu 2013-03-19, 16:20
+
Ted Yu 2013-03-19, 16:24
+
Andrew Purtell 2013-03-19, 16:49
+
ramkrishna vasudevan 2013-03-19, 16:54
+
Ted Yu 2013-03-19, 16:59
+
lars hofhansl 2013-03-19, 18:17
+
Ted Yu 2013-03-19, 21:12
+
lars hofhansl 2013-03-19, 22:50
+
Ted Yu 2013-03-19, 22:53
+
lars hofhansl 2013-03-19, 23:45
+
Stack 2013-03-23, 21:43
+
Sergey Shelukhin 2013-04-10, 00:01
+
Ted Yu 2013-04-10, 00:08
+
Stack 2013-04-10, 06:35
+
Nicolas Liochon 2013-04-10, 07:16
+
Stack 2013-04-10, 16:38
+
Sergey Shelukhin 2013-04-10, 18:43
+
Nicolas Liochon 2013-04-10, 19:04
+
Sergey Shelukhin 2013-04-10, 19:45
+
Ted Yu 2013-04-10, 19:52
+
Stack 2013-04-10, 20:03
+
Jean-Daniel Cryans 2013-04-23, 20:21
+
Stack 2013-04-24, 15:40
+
Andrew Purtell 2013-04-25, 01:02
+
Jonathan Hsieh 2013-05-02, 14:03
+
Jonathan Hsieh 2013-05-02, 14:00
+
Jonathan Hsieh 2013-05-02, 13:52
+
Jonathan Hsieh 2013-05-02, 14:20
+
Jonathan Hsieh 2013-05-02, 14:38
+
Jonathan Hsieh 2013-05-04, 18:20
+
Jonathan Hsieh 2013-05-04, 18:23
+
Jonathan Hsieh 2013-05-07, 13:17
+
Jonathan Hsieh 2013-05-07, 13:16
+
Jonathan Hsieh 2013-05-07, 13:15
+
Jonathan Hsieh 2013-05-07, 13:14
+
Jonathan Hsieh 2013-05-07, 13:19
+
Jonathan Hsieh 2013-05-06, 21:18
+
Jonathan Hsieh 2013-05-06, 21:17
+
Jonathan Hsieh 2013-05-06, 21:16
+
Jonathan Hsieh 2013-05-06, 21:12
+
Jonathan Hsieh 2013-05-06, 21:20
+
Sergey Shelukhin 2013-05-06, 22:01
+
Jonathan Hsieh 2013-05-07, 13:39
+
Jonathan Hsieh 2013-05-06, 21:19
+
Jonathan Hsieh 2013-05-08, 17:00
+
Jonathan Hsieh 2013-05-08, 16:59
+
Jonathan Hsieh 2013-05-08, 16:55
+
Jonathan Hsieh 2013-05-08, 16:57
+
Jonathan Hsieh 2013-05-08, 16:54
+
Stack 2013-05-09, 04:02
+
Stack 2013-05-09, 04:17
+
Stack 2013-05-09, 04:16
+
Stack 2013-05-09, 04:08
+
Andrew Purtell 2013-05-09, 07:35
+
Andrew Purtell 2013-05-09, 08:23
+
Ted Yu 2013-05-09, 09:07
+
Andrew Purtell 2013-05-09, 09:10
+
Ted Yu 2013-05-09, 09:18
+
Andrew Purtell 2013-05-09, 09:20
+
Andrew Purtell 2013-05-10, 10:48
+
Jonathan Hsieh 2013-05-09, 12:52
+
Jonathan Hsieh 2013-05-09, 12:51
+
Jonathan Hsieh 2013-05-09, 12:50
+
Jonathan Hsieh 2013-05-09, 12:48
+
Jonathan Hsieh 2013-05-09, 12:45
+
Jonathan Hsieh 2013-05-09, 12:44
+
Jonathan Hsieh 2013-05-09, 12:43
+
Stack 2013-05-15, 19:38
+
Stack 2013-05-15, 18:19
+
Ted Yu 2013-05-15, 18:26
+
Stack 2013-05-15, 18:32
+
Ted Yu 2013-05-15, 18:43
+
Jonathan Hsieh 2013-05-15, 19:23
+
Stack 2013-05-15, 18:06
+
Stack 2013-05-15, 08:31
+
Stack 2013-05-15, 23:41
+
Elliott Clark 2013-05-16, 00:01
+
Stack 2013-05-16, 21:42
+
Ted Yu 2013-05-17, 23:07
+
Stack 2013-05-18, 03:27
+
Stack 2013-05-24, 05:17
+
lars hofhansl 2013-05-25, 07:22
+
Ted Yu 2013-05-25, 15:52
+
lars hofhansl 2013-05-29, 00:54
+
Andrew Purtell 2013-05-29, 15:05
+
Andrew Purtell 2013-05-29, 15:12
+
lars hofhansl 2013-05-29, 17:39
+
Andrew Purtell 2013-06-11, 02:35