Home | About | Sematext search-lucene.com search-hadoop.com
 Search Hadoop and all its subprojects:

Switch to Threaded View
MapReduce >> mail # dev >> Hadoop-Mapreduce-trunk - Build # 1678 - Still Failing


Copy link to this message
-
Hadoop-Mapreduce-trunk - Build # 1689 - Still Failing
See https://builds.apache.org/job/Hadoop-Mapreduce-trunk/1689/

###################################################################################
########################## LAST 60 LINES OF THE CONSOLE ###########################
[...truncated 34633 lines...]
Tests run: 4, Failures: 0, Errors: 0, Skipped: 0, Time elapsed: 1.694 sec - in org.apache.hadoop.mapreduce.v2.app.launcher.TestContainerLauncherImpl
Running org.apache.hadoop.mapreduce.v2.app.launcher.TestContainerLauncher
Tests run: 3, Failures: 0, Errors: 0, Skipped: 0, Time elapsed: 13.706 sec - in org.apache.hadoop.mapreduce.v2.app.launcher.TestContainerLauncher
Running org.apache.hadoop.mapreduce.jobhistory.TestJobHistoryEventHandler
Tests run: 7, Failures: 0, Errors: 0, Skipped: 0, Time elapsed: 10.255 sec - in org.apache.hadoop.mapreduce.jobhistory.TestJobHistoryEventHandler
Running org.apache.hadoop.mapreduce.jobhistory.TestEvents
Tests run: 5, Failures: 0, Errors: 0, Skipped: 0, Time elapsed: 0.726 sec - in org.apache.hadoop.mapreduce.jobhistory.TestEvents

Results :

Tests in error:
  TestRMContainerAllocator.testCompletedTasksRecalculateSchedule:1665 » YarnRuntime

Tests run: 262, Failures: 0, Errors: 1, Skipped: 0

[INFO] ------------------------------------------------------------------------
[INFO] Reactor Summary:
[INFO]
[INFO] hadoop-mapreduce-client ........................... SUCCESS [3.862s]
[INFO] hadoop-mapreduce-client-core ...................... SUCCESS [47.660s]
[INFO] hadoop-mapreduce-client-common .................... SUCCESS [25.686s]
[INFO] hadoop-mapreduce-client-shuffle ................... SUCCESS [2.411s]
[INFO] hadoop-mapreduce-client-app ....................... FAILURE [6:17.777s]
[INFO] hadoop-mapreduce-client-hs ........................ SKIPPED
[INFO] hadoop-mapreduce-client-jobclient ................. SKIPPED
[INFO] hadoop-mapreduce-client-hs-plugins ................ SKIPPED
[INFO] Apache Hadoop MapReduce Examples .................. SKIPPED
[INFO] hadoop-mapreduce .................................. SKIPPED
[INFO] ------------------------------------------------------------------------
[INFO] BUILD FAILURE
[INFO] ------------------------------------------------------------------------
[INFO] Total time: 7:38.954s
[INFO] Finished at: Wed Feb 05 13:29:59 UTC 2014
[INFO] Final Memory: 24M/109M
[INFO] ------------------------------------------------------------------------
[ERROR] Failed to execute goal org.apache.maven.plugins:maven-surefire-plugin:2.16:test (default-test) on project hadoop-mapreduce-client-app: There are test failures.
[ERROR]
[ERROR] Please refer to /home/jenkins/jenkins-slave/workspace/Hadoop-Mapreduce-trunk/trunk/hadoop-mapreduce-project/hadoop-mapreduce-client/hadoop-mapreduce-client-app/target/surefire-reports for the individual test results.
[ERROR] -> [Help 1]
[ERROR]
[ERROR] To see the full stack trace of the errors, re-run Maven with the -e switch.
[ERROR] Re-run Maven using the -X switch to enable full debug logging.
[ERROR]
[ERROR] For more information about the errors and possible solutions, please read the following articles:
[ERROR] [Help 1] http://cwiki.apache.org/confluence/display/MAVEN/MojoFailureException
[ERROR]
[ERROR] After correcting the problems, you can resume the build with the command
[ERROR]   mvn <goals> -rf :hadoop-mapreduce-client-app
Build step 'Execute shell' marked build as failure
[FINDBUGS] Skipping publisher since build result is FAILURE
Archiving artifacts
Updating YARN-1461
Updating HDFS-5399
Updating YARN-1669
Updating HDFS-5709
Updating YARN-1634
Updating HADOOP-10273
Email was triggered for: Failure
Sending email for trigger: Failure

###################################################################################
############################## FAILED TESTS (if any) ##############################
No tests ran.