Home | About | Sematext search-lucene.com search-hadoop.com
clear query|facets|time Search criteria: .   Results from 1 to 9 from 9 (0.122s).
Loading phrases to help you
refine your search...
[PIG-4083] TestAccumuloPigCluster always failed with timeout error - Pig - [issue]
...TestAccumuloPigCluster always failed with timeout error.Tried with sun jdk 6 and sun jdk 7....
http://issues.apache.org/jira/browse/PIG-4083    Author: fang fang chen, 2014-07-30, 09:56
[PIG-4047] Break up pig withouthadoop and fat jar - Pig - [issue]
...pig-withouthadoop jar is packaging pig core and pig core dependencies. But this jar should be removed due to following items:1. the name is confusing. User did not know what the jar is used ...
http://issues.apache.org/jira/browse/PIG-4047    Author: fang fang chen, 2014-07-27, 20:41
[PIG-4053] TestMRCompiler succeeded with sun jdk 1.6 while failed with sun jdk 1.7 - Pig - [issue]
...TestMRCompiler succeeded with sun jdk 1.6.0_45 while failed with sun jdk 1.7.0_60 with following error message:Testcase: testMergeJoin took 0.193 sec FAILEDexpected:<....PigStorage','eNqt...
http://issues.apache.org/jira/browse/PIG-4053    Author: fang fang chen, 2014-07-27, 07:27
[PIG-4052] TestJobControlSleep, TestInvokerSpeed are unreliable - Pig - [issue]
...This test case failed on both sun jdk 1.7 and sun jdk 1.6.sun jdk 1.6 error msg:Testcase: testLocalModeTakesLessThan5secs took 6.397 sec        FAILEDmust take less ...
http://issues.apache.org/jira/browse/PIG-4052    Author: fang fang chen, 2014-07-27, 07:13
[PIG-3058] Upgrade junit to at least 4.8 - Pig - [issue]
...Pig needs to upgrade junit version to at least 4.8. Otherwise, one gets following warnings.  [javadoc] org/apache/hadoop/hbase/mapreduce/TestWALPlayer.class(org/apache/hado...
http://issues.apache.org/jira/browse/PIG-3058    Author: fang fang chen, 2013-02-22, 04:54
[PIG-3033] test-patch failed with javadoc warnings - Pig - [issue]
...During test-patch, the build failed with javadoc warning. But these warnings are not contributed by new patch.Can reproduce by following cmd.command: ant  -DPigPatchProcess= clean javad...
http://issues.apache.org/jira/browse/PIG-3033    Author: fang fang chen, 2012-12-10, 06:42
[PIG-2281] pig-0.8.1: some unit test case failed with open source JDK - Pig - [issue]
...Based on my analysis, I think this is because HashMap does not guarantee ordering.1.[junit] Running org.apache.pig.test.TestDataModel[junit] Tests run: 22, Failures: 1, Error...
http://issues.apache.org/jira/browse/PIG-2281    Author: fang fang chen, 2012-11-19, 10:30
[PIG-2405] svn tags/release-0.9.1: some unit test case failed with open JDK - Pig - [issue]
...   [junit] Test org.apache.pig.test.TestDataModel FAILEDTestcase: testTupleToString took 0.004 sec        FAILEDtoString expected:<...ad a littl...
http://issues.apache.org/jira/browse/PIG-2405    Author: fang fang chen, 2012-11-08, 04:48
[PIG-2753] In distributed mapreduce mode, pig can not get correct hbase configuration - Pig - [issue]
...Hadoop/Hbase/Zookeeper/pig node distribution:hadoop nodes: {node1=[namenode, secondarynamenode, jobtracker], node2=[datanode, tasktracker]}hbase nodes: {node1=[master, regionserver]}pig node...
http://issues.apache.org/jira/browse/PIG-2753    Author: fang fang chen, 2012-06-21, 05:06
Pig (9)
Flume (5)
Hadoop (1)
Sqoop (1)
issue (9)
last 7 days (4)
last 30 days (4)
last 90 days (4)
last 6 months (4)
last 9 months (9)
Daniel Dai (361)
Dmitriy Ryaboy (346)
Alan Gates (333)
Cheolsoo Park (292)
Jonathan Coveney (237)
Rohini Palaniswamy (174)
Russell Jurney (174)
Bill Graham (131)
Olga Natkovich (130)
Prashant Kommireddi (107)
Aniket Mokashi (87)
Julien Le Dem (84)
Thejas Nair (69)
Thejas M Nair (63)
Mridul Muralidharan (61)
Ashutosh Chauhan (41)
pi song (41)
Gianmarco De Francisci Mo...(38)
"Cheolsoo Park (35)
Ruslan Al-Fakikh (35)
Dmitriy V. Ryaboy (34)
Koji Noguchi (34)
Pradeep Gollakota (33)
Jeff Zhang (32)
Santhosh Srinivasan (29)
fang fang chen