Home | About | Sematext search-lucene.com search-hadoop.com
clear query|facets|time Search criteria: .   Results from 1 to 7 from 7 (0.056s).
Loading phrases to help you
refine your search...
[MAPREDUCE-5834] TestGridMix#testSleepReducer fails on trunk and branch-2 - MapReduce - [issue]
...testSleepReducer times out everytime I try to run it.java.lang.Exception: test timed out after 1000 milliseconds at org.apache.hadoop.mapred.gridmix.TestGridMixClasses$FakeRawKeyValueReducer...
http://issues.apache.org/jira/browse/MAPREDUCE-5834    Author: Mit Desai, 2014-04-15, 17:00
[MAPREDUCE-5823] TestTaskAttempt fails in trunk and branch-2 with NPE - MapReduce - [issue]
...Here is the console output I gotjava.lang.NullPointerException: null at org.apache.hadoop.security.token.Token.write(Token.java:221) at org.apache.hadoop.mapred.ShuffleHandler.serializeServi...
http://issues.apache.org/jira/browse/MAPREDUCE-5823    Author: Mit Desai, 2014-04-09, 17:13
[MAPREDUCE-5810] TestStreamingTaskLog#testStreamingTaskLogWithHadoopCmd is failing - MapReduce - [issue]
...testStreamingTaskLogWithHadoopCmd(org.apache.hadoop.streaming.TestStreamingTaskLog)  Time elapsed: 44.069 sec  <<< FAILURE!java.lang.AssertionError: environment set for ch...
http://issues.apache.org/jira/browse/MAPREDUCE-5810    Author: Mit Desai, 2014-03-30, 15:07
[MAPREDUCE-5804] TestMRJobsWithProfiler#testProfiler timesout - MapReduce - [issue]
...testProfiler(org.apache.hadoop.mapreduce.v2.TestMRJobsWithProfiler)  Time elapsed: 154.972 sec  <<< ERROR!java.lang.Exception: test timed out after 120000 milliseconds at ...
http://issues.apache.org/jira/browse/MAPREDUCE-5804    Author: Mit Desai, 2014-03-22, 15:00
[MAPREDUCE-5688] TestStagingCleanup fails intermittently with JDK7 - MapReduce - [issue]
...Due to random ordering ordering in JDK7, the test TestStagingCleanup#testDeletionofStagingOnKillLastTry is failingTests run: 1, Failures: 0, Errors: 1, Skipped: 0, Time elapsed: 4.231 sec &l...
http://issues.apache.org/jira/browse/MAPREDUCE-5688    Author: Mit Desai, 2014-03-14, 15:56
Re: [VOTE] Release Apache Hadoop 2.3.0 - MapReduce - [mail # dev]
...+1 Non BindingTested on: Fedora17 with JDK7-Downloaded the tar-Successful Build with ³mvm install -DskipTests² and ³mvm install -Pnative-DskipTests²-Successfully Verified Signature and Diges...
   Author: Mit Desai, 2014-02-12, 21:34
[MAPREDUCE-5731] testMiniMRChildtask fails on branch-2 - MapReduce - [issue]
...org.apache.hadoop.yarn.exceptions.YarnRuntimeException: java.io.FileNotFoundException: File file:/tmp/hadoop-yarn/staging/history/done_intermediate does not exist at org.apache.hadoop.mapred...
http://issues.apache.org/jira/browse/MAPREDUCE-5731    Author: Mit Desai, 2014-02-05, 23:41
Sort:
project
HDFS (14)
Yarn (9)
Hadoop (7)
MapReduce (6)
type
issue (6)
mail # dev (1)
date
last 7 days (1)
last 30 days (4)
last 90 days (7)
last 6 months (7)
last 9 months (7)
author
Harsh J (454)
Arun C Murthy (325)
Vinod Kumar Vavilapalli (308)
Todd Lipcon (197)
Amar Kamat (180)
Thomas Graves (164)
Amareshwari Sriramadasu (153)
Jason Lowe (150)
Owen O'Malley (126)
Sandy Ryza (123)
Tom White (111)
Siddharth Seth (109)
Aaron Kimball (107)
Ramya Sunil (103)
Devaraj K (102)
Mit Desai