Home | About | Sematext search-lucene.com search-hadoop.com
clear query|facets|time Search criteria: .   Results from 21 to 30 from 57 (0.057s).
Loading phrases to help you
refine your search...
[HADOOP-9472] Cleanup hadoop-config.cmd - Hadoop - [issue]
...Some portions of hadoop-config.cmd script are unused and should be cleaned up....
http://issues.apache.org/jira/browse/HADOOP-9472    Author: Ivan Mitic, 2013-04-29, 04:22
[HADOOP-8412] TestModTime, TestDelegationToken and TestAuthenticationToken fail intermittently on Windows - Hadoop - [issue]
...Jira tracking failures from the summary....
http://issues.apache.org/jira/browse/HADOOP-8412    Author: Ivan Mitic, 2013-04-26, 16:09
[HADOOP-9452] Windows install scripts bugfixes - Hadoop - [issue]
...A few bugfixes we've done to install scripts on Windows....
http://issues.apache.org/jira/browse/HADOOP-9452    Author: Ivan Mitic, 2013-04-20, 21:11
[HADOOP-9480] The windows installer should pick the config from src\packages\win\template\conf - Hadoop - [issue]
...We should pick the config files from the "src\packages\win\template\conf" location rather than the conf\ location in the Windows installer.Reported by Mostafa Elhemali....
http://issues.apache.org/jira/browse/HADOOP-9480    Author: Ivan Mitic, 2013-04-20, 21:01
[HADOOP-8731] TestTrackerDistributedCacheManager fails on Windows - Hadoop - [issue]
...Jira tracking TestTrackerDistributedCacheManager test failure....
http://issues.apache.org/jira/browse/HADOOP-8731    Author: Ivan Mitic, 2013-04-10, 23:00
[HADOOP-9463] branch-1-win fails to build with OpenJDK7 - Hadoop - [issue]
...Build fails with the following error:I:\svn\trunk_rebase\hadoop-common [branch-1-win]> ant clean winpkgBuildfile: I:\svn\trunk_rebase\hadoop-common\build.xmlBUILD FAILEDI:\svn\tru...
http://issues.apache.org/jira/browse/HADOOP-9463    Author: Ivan Mitic, 2013-04-10, 02:13
[HADOOP-9177] Address issues that came out from running static code analysis on winutils - Hadoop - [issue]
http://issues.apache.org/jira/browse/HADOOP-9177    Author: Ivan Mitic, 2013-03-29, 01:35
[HADOOP-9387] TestDFVariations fails on Windows after the merge - Hadoop - [issue]
...Test fails with the following errors:Running org.apache.hadoop.fs.TestDFVariationsTests run: 4, Failures: 0, Errors: 2, Skipped: 0, Time elapsed: 0.186 sec <<< FAILURE!testOSParsing...
http://issues.apache.org/jira/browse/HADOOP-9387    Author: Ivan Mitic, 2013-03-22, 14:05
[HADOOP-9099] NetUtils.normalizeHostName fails on domains where UnknownHost resolves to an IP address - Hadoop - [issue]
...I just hit this failure. We should use some more unique string for "UnknownHost":Testcase: testNormalizeHostName took 0.007 sec FAILEDexpected:<[65.53.5.181]> but was:<[...
http://issues.apache.org/jira/browse/HADOOP-9099    Author: Ivan Mitic, 2013-03-13, 14:06
[HADOOP-9376] TestProxyUserFromEnv fails on a Windows domain joined machine - Hadoop - [issue]
...TestProxyUserFromEnv#testProxyUserFromEnvironment fails with the following error on my machine:org.junit.ComparisonFailure: expected:<[redmond]ivanmi> but was:<[]ivanmi> at org.j...
http://issues.apache.org/jira/browse/HADOOP-9376    Author: Ivan Mitic, 2013-03-07, 14:04
Sort:
project
Hadoop (57)
HDFS (15)
MapReduce (14)
Zookeeper (1)
type
issue (54)
mail # dev (2)
mail # user (1)
date
last 7 days (1)
last 30 days (2)
last 90 days (2)
last 6 months (5)
last 9 months (57)
author
Harsh J (537)
Owen O'Malley (402)
Steve Loughran (357)
Todd Lipcon (234)
Eli Collins (181)
Arun C Murthy (157)
Chris Nauroth (129)
Alejandro Abdelnur (122)
Allen Wittenauer (115)
Nigel Daley (112)
Tom White (110)
Daryn Sharp (108)
Konstantin Shvachko (102)
Ted Yu (94)
Aaron Kimball (93)
Ivan Mitic