Home | About | Sematext search-lucene.com search-hadoop.com
clear query|facets|time Search criteria: .   Results from 21 to 30 from 97 (0.112s).
Loading phrases to help you
refine your search...
[HDFS-6160] TestSafeMode occasionally fails - HDFS - [issue]
...From https://builds.apache.org/job/PreCommit-HDFS-Build/6511//testReport/org.apache.hadoop.hdfs/TestSafeMode/testInitializeReplQueuesEarly/ :java.lang.AssertionError: expected:<13> but...
http://issues.apache.org/jira/browse/HDFS-6160    Author: Ted Yu, 2014-04-10, 20:08
[HDFS-5672] TestHASafeMode#testSafeBlockTracking fails in trunk - HDFS - [issue]
...From build #1614: TestHASafeMode.testSafeBlockTracking:623->assertSafeMode:488 Bad safemode status: 'Safe mode is ON. The reported blocks 3 needs additional 7 blocks to reach the thr...
http://issues.apache.org/jira/browse/HDFS-5672    Author: Ted Yu, 2014-04-10, 14:12
[HDFS-6177] TestHttpFSServer fails occasionally in trunk - HDFS - [issue]
...From https://builds.apache.org/job/Hadoop-hdfs-trunk/1716/consoleFull :Running org.apache.hadoop.fs.http.server.TestHttpFSServerTests run: 7, Failures: 1, Errors: 0, Skipped: 0, Time elapsed...
http://issues.apache.org/jira/browse/HDFS-6177    Author: Ted Yu, 2014-03-30, 15:13
[HDFS-5997] TestHASafeMode#testBlocksAddedWhileStandbyIsDown fails in trunk - HDFS - [issue]
...From https://builds.apache.org/job/Hadoop-Hdfs-trunk/1681/ :REGRESSION:  org.apache.hadoop.hdfs.server.namenode.ha.TestHASafeMode.testBlocksAddedWhileStandbyIsDownError Message:Bad safe...
http://issues.apache.org/jira/browse/HDFS-5997    Author: Ted Yu, 2014-03-14, 18:00
[HDFS-6092] DistributedFileSystem#getCanonicalServiceName() and DistributedFileSystem#getUri() may return inconsistent results w.r.t. port - HDFS - [issue]
...I discovered this when working on HBASE-10717Here is sample code to reproduce the problem:    Path desPath = new Path("hdfs://127.0.0.1/");    FileSystem desFs ...
http://issues.apache.org/jira/browse/HDFS-6092    Author: Ted Yu, 2014-03-13, 17:52
[HDFS-5705] TestSecondaryNameNodeUpgrade#testChangeNsIDFails may fail due to ConcurrentModificationException - HDFS - [issue]
...From https://builds.apache.org/job/Hadoop-Hdfs-trunk/1626/testReport/org.apache.hadoop.hdfs.server.namenode/TestSecondaryNameNodeUpgrade/testChangeNsIDFails/ :java.util.ConcurrentModificatio...
http://issues.apache.org/jira/browse/HDFS-5705    Author: Ted Yu, 2014-03-13, 14:56
[HDFS-6081] TestRetryCacheWithHA#testCreateSymlink occasionally fails in trunk - HDFS - [issue]
...From https://builds.apache.org/job/Hadoop-Hdfs-trunk/1696/testReport/junit/org.apache.hadoop.hdfs.server.namenode.ha/TestRetryCacheWithHA/testCreateSymlink/ :2014-03-09 13:18:47,515 WARN &nb...
http://issues.apache.org/jira/browse/HDFS-6081    Author: Ted Yu, 2014-03-09, 15:12
[HDFS-5839] TestWebHDFS#testNamenodeRestart fails with NullPointerException in trunk - HDFS - [issue]
...Here is test failure:testNamenodeRestart(org.apache.hadoop.hdfs.web.TestWebHDFS)  Time elapsed: 45.206 sec  <<< FAILURE!java.lang.AssertionError: There are 1 exception(s):...
http://issues.apache.org/jira/browse/HDFS-5839    Author: Ted Yu, 2014-03-04, 22:09
[HDFS-6037] TestIncrementalBlockReports#testReplaceReceivedBlock fails occasionally in trunk - HDFS - [issue]
...From https://builds.apache.org/job/Hadoop-Hdfs-trunk/1688/testReport/junit/org.apache.hadoop.hdfs.server.datanode/TestIncrementalBlockReports/testReplaceReceivedBlock/ :datanodeProtocolClien...
http://issues.apache.org/jira/browse/HDFS-6037    Author: Ted Yu, 2014-03-01, 14:58
[HDFS-5710] FSDirectory#getFullPathName should check inodes against null - HDFS - [issue]
...From https://builds.apache.org/job/hbase-0.96-hadoop2/166/testReport/junit/org.apache.hadoop.hbase.mapreduce/TestTableInputFormatScan1/org_apache_hadoop_hbase_mapreduce_TestTableInputFormatS...
http://issues.apache.org/jira/browse/HDFS-5710    Author: Ted Yu, 2014-02-24, 20:58
Sort:
project
HBase (2656)
Hadoop (279)
MapReduce (134)
HDFS (89)
Hive (50)
Accumulo (40)
YARN (39)
Zookeeper (31)
Spark (9)
Drill (2)
Avro (1)
type
issue (48)
mail # user (32)
mail # dev (17)
date
last 7 days (2)
last 30 days (6)
last 90 days (20)
last 6 months (35)
last 9 months (97)
author
Todd Lipcon (317)
Eli Collins (263)
Harsh J (261)
Colin Patrick McCabe (230)
Tsz Wo (206)
Chris Nauroth (166)
Jing Zhao (162)
Aaron T. Myers (141)
Suresh Srinivas (138)
Haohui Mai (135)
Andrew Wang (131)
Brandon Li (125)
Kihwal Lee (113)
Arpit Agarwal (109)
Daryn Sharp (100)
Uma Maheswara Rao G (79)
Ted Yu (75)
Alejandro Abdelnur (67)
Konstantin Shvachko (59)
Akira AJISAKA (54)
Stephen Chu (54)
Steve Loughran (51)
Azuryy Yu (48)
Yongjun Zhang (48)
Mohammad Tariq (46)